{"text_format":"1","workbook":"xlsx","n_sheets":16,"sheets":["start","預り証","大会負担金集計表","入力方法","令和３年度　改訂","県大会入力シート","R4～様式K","県大会負担金納入書","県特例申請書","市大会入力シート","市大会申込書","市大会負担金納入書","市特例申請書","H30～新様式K 記入方法","特例引率選手名簿","学校一覧"],"not_rendered":{"charts":0,"images":25,"macros":1,"external_links":0,"defined_names":13,"comments":0,"pivot_tables":0},"unopened":[],"bounds":{"document_bytes":16777216,"sheet_cells":100000,"rows_first":2000,"rows_last":500,"rows_between":2000,"halvings":0,"cell_chars":16384,"cell_head_chars":4096},"cells_cut":0,"cells_raw":0,"read":"whole","date_system":"1900"}

{"sheet":"start","index":0,"n_rows":51,"n_cols":7,"rows_kept":51,"cut":false,"hidden":false,"merged":[]}
[]
[]
[null,null,null,"広島県中体連水泳競技専門委員会"]
[]
[]
[null,null,1,"　初期設定・・・学校名を選択し，校長名を入力してください。"]
[]
[null,null,null,"初期設定",null,"学校名","広島市立己斐中学校"]
[]
[null,null,null,null,null,"校長名","溝下　明美"]
[]
[]
[null,null,2,"　特例引率選手の登録（※学校に水泳部がなく，特例引率で大会に参加する学校のみ）"]
[]
[null,null,null,"特例引率選手登録"]
[]
[]
[]
[]
[null,null,3,"　作成する大会を選びます。"]
[]
[null,null,null,"広島市大会または"]
[null,null,null,"　広島県大会の選択"]
[]
[]
[]
[]
[]
[]
[]
[null,null,null,"各中学校の顧問・担当の先生へお願い"]
[]
[null,null,null,"・学校名の変更や新設校の追加，住所や電話番号等の変更により表示される情報に"]
[null,null,null,"　誤りがあった場合，専門委員会担当へ連絡をお願いします。"]
[null,null,null,"・各書類作成のうえでお困りのことは，専門委員会担当者へ連絡してください。"]
[]
[null,null,null,"連絡先","広島県中体連水泳競技専門委員会・・・柴野（段原中：082-281-9171）"]
[null,null,null,null,"広島市中体連水泳競技専門委員会・・・藤田（亀山中：082-814-8834）"]
[null,null,null,null,"湯田（shinyuda@gmail.com）"]
[]
[]
[null,null,null,"預り証の印刷，「学校一覧」ｼｰﾄ編集（専門委員会担当者のみ）"]
[]
[null,null,null,"預り証と，控え"]
[null,null,null,"負担金集計表の印刷"]
[]
[]
[null,null,null,"「学校一覧」ｼｰﾄ表示"]
[]
[]
[null,null,null,null,null,null,"　　　　　※パスワード必要"]

{"sheet":"預り証","index":1,"n_rows":378,"n_cols":54,"rows_kept":378,"cut":false,"hidden":true,"merged":[[117,12,117,18],[105,5,105,8],[105,9,105,20],[109,7,109,9],[109,12,109,14],[112,6,112,7],[112,8,112,9],[112,11,112,12],[112,14,112,15],[95,4,96,19],[98,3,99,12],[101,6,102,7],[101,8,102,15],[101,16,102,17],[18,5,18,8],[6,18,6,21],[48,5,48,8],[18,9,18,20],[48,9,48,20],[44,6,45,7],[44,8,45,15],[60,12,60,18],[14,8,15,15],[14,6,15,7],[14,16,15,17],[8,9,9,13],[11,3,12,12],[41,3,42,12],[22,7,22,9],[22,12,22,14],[25,11,25,12],[25,14,25,15],[25,8,25,9],[25,6,25,7],[30,12,30,18],[38,4,39,19],[44,16,45,17],[52,7,52,9],[52,12,52,14],[55,6,55,7],[55,8,55,9],[55,11,55,12],[55,14,55,15]]}
[null,2,3,4,5,6,7,8,9,10,11,12,13,14,15,16,17,18,19,20,21,22,23,24,25,26,27,28,29,30,31,32,33,34,35,36,37,38,39,40,41,42,43,44,45,46,47,48,49,50,51,52,53,54]
[null,1,2,3,4,5,6,7,8,9,10,11,12,13,14,15,16,17,18,19,20,21,22,null,null,null,null,null,null,null,null,null,null,null,null,null,null,null,null,"出場校数（印刷枚数）→",null,null,{"$f":"COUNTIF(AQ6:AQ375,\">=1\")","v":1}]
[null,null,null,null,null,null,null,{"$f":"YEAR( TODAY())-2018","v":5},null,null,null,null,null,null,null,null,null,null,null,null,null,null,null,null,null,null,null,null,null,null,null,null,null,null,null,null,null,null,null,"男女別合計→",{"$f":"SUM(AO6:AO375)","v":11},{"$f":"SUM(AP6:AP375)","v":0},{"$f":"SUM(AO3:AP3)","v":11}]
[null,null,null,null,null,null,null,null,null,null,null,null,null,null,null,null,null,null,null,null,null,null,null,null,null,null,null,null,null,null,null,1,2,3,4,5,6,7,8,9,10,11,12]
[null,null,null,null,null,null,null,null,null,null,null,null,null,null,null,null,null,null,null,null,null,null,null,null,null,null,null,null,null,null,null,{"$f":"学校一覧!A6","v":"連番"},{"$f":"学校一覧!B6","v":"県中連番１"},{"$f":"学校一覧!C6","v":"水泳連番"},{"$f":"学校一覧!D6","v":"地区名"},{"$f":"学校一覧!E6","v":"正　式　学　校　名"},{"$f":"学校一覧!F6","v":"登録番号"},null,null,null,"男子","女子","合計"]
[1,1,null,null,null,null,null,null,null,null,null,null,null,null,null,null,null,null,null,null,null,null,null,null,null,null,null,null,null,null,null,{"$f":"学校一覧!A7","v":1},{"$f":"学校一覧!B7","v":1},{"$f":"学校一覧!C7","v":1},{"$f":"学校一覧!D7","v":"広島地区　広島市中区"},{"$f":"学校一覧!E7","v":"広島市立幟町中学校"},{"$f":"学校一覧!F7","v":"34A01"},null,null,null,11,null,{"$f":"SUM(AO6:AP6)","v":11}]
[2,null,null,null,null,null,null,null,null,null,null,null,null,null,null,null,null,null,null,null,null,null,null,null,null,null,null,null,null,null,null,{"$f":"学校一覧!A8","v":2},{"$f":"学校一覧!B8","v":2},{"$f":"学校一覧!C8","v":2},{"$f":"学校一覧!D8","v":0},{"$f":"学校一覧!E8","v":"広島市立吉島中学校"},{"$f":"学校一覧!F8","v":"34A02"},null,null,null,null,null,{"$f":"SUM(AO7:AP7)","v":0}]
[3,null,null,null,null,null,null,null,null,null,null,null,null,null,null,null,null,null,null,null,null,null,null,null,null,null,null,null,null,null,null,{"$f":"学校一覧!A9","v":3},{"$f":"学校一覧!B9","v":3},{"$f":"学校一覧!C9","v":3},{"$f":"学校一覧!D9","v":0},{"$f":"学校一覧!E9","v":"広島市立国泰寺中学校"},{"$f":"学校一覧!F9","v":"34A03"},null,null,null,null,null,0]
[4,null,null,null,null,null,null,null,null,"預　り　証",null,null,null,null,null,null,null,null,null,null,null,null,null,null,null,null,null,null,null,null,null,{"$f":"学校一覧!A10","v":4},{"$f":"学校一覧!B10","v":4},{"$f":"学校一覧!C10","v":4},{"$f":"学校一覧!D10","v":0},{"$f":"学校一覧!E10","v":"広島市立江波中学校"},{"$f":"学校一覧!F10","v":"34A04"},null,null,null,null,null,0]
[5,null,null,null,null,null,null,null,null,null,null,null,null,null,null,null,null,null,null,null,null,null,null,null,null,null,null,null,null,null,null,{"$f":"学校一覧!A11","v":5},{"$f":"学校一覧!B11","v":5},{"$f":"学校一覧!C11","v":5},{"$f":"学校一覧!D11","v":0},{"$f":"学校一覧!E11","v":"修道中学校"},{"$f":"学校一覧!F11","v":34084},null,null,null,null,null,0]
[6,null,null,null,null,null,null,null,null,null,null,null,null,null,null,null,null,null,null,null,null,null,null,null,null,null,null,null,null,null,null,{"$f":"学校一覧!A12","v":6},{"$f":"学校一覧!B12","v":6},{"$f":"学校一覧!C12","v":6},{"$f":"学校一覧!D12","v":0},{"$f":"学校一覧!E12","v":"安田女子中学校"},{"$f":"学校一覧!F12","v":"34A06"},null,null,null,null,null,0]
[7,null,null,{"$f":"IF(ISERROR(VLOOKUP($B6,学校一覧!A7:Q400,5,FALSE))=FALSE,VLOOKUP($B6,学校一覧!A6:Q400,5,FALSE),\"\")&\"長 様\"","v":"広島市立幟町中学校長 様"},null,null,null,null,null,null,null,null,null,null,null,null,null,null,null,null,null,null,null,null,null,null,null,null,null,null,null,{"$f":"学校一覧!A13","v":7},{"$f":"学校一覧!B13","v":7},{"$f":"学校一覧!C13","v":7},{"$f":"学校一覧!D13","v":0},{"$f":"学校一覧!E13","v":"広島女学院中学校"},{"$f":"学校一覧!F13","v":"34A07"},null,null,null,null,null,0]
[8,null,null,null,null,null,null,null,null,null,null,null,null,null,null,null,null,null,null,null,null,null,null,null,null,null,null,null,null,null,null,{"$f":"学校一覧!A14","v":8},{"$f":"学校一覧!B14","v":8},{"$f":"学校一覧!C14","v":8},{"$f":"学校一覧!D14","v":0},{"$f":"学校一覧!E14","v":"広島県立広島南特別支援学校"},{"$f":"学校一覧!F14","v":0},null,null,null,null,null,0]
[9,null,null,null,null,null,null,null,null,null,null,null,null,null,null,null,null,null,null,null,null,null,null,null,null,null,null,null,null,null,null,{"$f":"学校一覧!A15","v":9},{"$f":"学校一覧!B15","v":0},{"$f":"学校一覧!C15","v":0},{"$f":"学校一覧!D15","v":0},{"$f":"学校一覧!E15","v":"予備"},{"$f":"学校一覧!F15","v":0},null,null,null,null,null,0]
[10,null,null,null,null,null,"金",null,{"$f":"H23*M23","v":1100},null,null,null,null,null,null,null,"円",null,null,null,null,null,null,null,null,null,null,null,null,null,null,{"$f":"学校一覧!A16","v":10},{"$f":"学校一覧!B16","v":0},{"$f":"学校一覧!C16","v":0},{"$f":"学校一覧!D16","v":0},{"$f":"学校一覧!E16","v":"予備"},{"$f":"学校一覧!F16","v":0},null,null,null,null,null,0]
[11,null,null,null,null,null,null,null,null,null,null,null,null,null,null,null,null,null,null,null,null,null,null,null,null,null,null,null,null,null,null,{"$f":"学校一覧!A17","v":11},{"$f":"学校一覧!B17","v":0},{"$f":"学校一覧!C17","v":0},{"$f":"学校一覧!D17","v":0},{"$f":"学校一覧!E17","v":"予備"},{"$f":"学校一覧!F17","v":0},null,null,null,null,null,0]
[12,null,null,null,null,null,null,null,null,null,null,null,null,null,null,null,null,null,null,null,null,null,null,null,null,null,null,null,null,null,null,{"$f":"学校一覧!A18","v":12},{"$f":"学校一覧!B18","v":17},{"$f":"学校一覧!C18","v":9},{"$f":"学校一覧!D18","v":"広島地区　広島市南区"},{"$f":"学校一覧!E18","v":"広島市立大州中学校"},{"$f":"学校一覧!F18","v":"34A17"},null,null,null,null,null,0]
[13,null,null,null,null,null,null,null,null,null,null,null,null,null,null,null,null,null,null,null,null,null,null,null,null,null,null,null,null,null,null,{"$f":"学校一覧!A19","v":13},{"$f":"学校一覧!B19","v":18},{"$f":"学校一覧!C19","v":10},{"$f":"学校一覧!D19","v":0},{"$f":"学校一覧!E19","v":"広島市立段原中学校"},{"$f":"学校一覧!F19","v":"34A18"},null,null,null,null,null,0]
[14,null,null,"但し，",null,{"$f":"IF(J19=\"広島市中学校水泳競技選手権大会\",\"令和\"&VLOOKUP(H3,J132:S161,1,)&\"年度\",IF(J19=\"広島市中学校新人水泳競技大会\",\"令和\"&VLOOKUP(H3,J132:S161,1,)&\"年度\",IF(J19=\"広島県中学校水泳競技選手権大会(競泳競技)\",\"第\"&VLOOKUP(H3,J132:S161,7,)&\"回\",IF(J19=\"広島県中学校新人水泳競技大会\",\"第\"&VLOOKUP(H3,J132:S161,10,)&\"回\",\"第\"&VLOOKUP(H3,J132:S161,6,)&\"回\"))))","v":"第71回"},null,null,null,"広島市中学校総合体育大会（水泳競技の部）",null,null,null,null,null,null,null,null,null,null,null,null,null,null,null,null,null,null,null,null,null,{"$f":"学校一覧!A20","v":14},{"$f":"学校一覧!B20","v":19},{"$f":"学校一覧!C20","v":11},{"$f":"学校一覧!D20","v":0},{"$f":"学校一覧!E20","v":"広島市立翠町中学校"},{"$f":"学校一覧!F20","v":"34A19"},null,null,null,null,null,0]
[15,null,null,null,null,null,null,null,null,null,null,null,null,null,null,null,null,null,null,null,null,null,null,null,null,null,null,null,null,null,null,{"$f":"学校一覧!A21","v":15},{"$f":"学校一覧!B21","v":20},{"$f":"学校一覧!C21","v":12},{"$f":"学校一覧!D21","v":0},{"$f":"学校一覧!E21","v":"広島市立仁保中学校"},{"$f":"学校一覧!F21","v":"34A20"},null,null,null,null,null,0]
[16,null,null,null,null,"競技名　水泳競技",null,null,null,null,null,null,null,null,null,null,null,null,null,null,null,null,null,null,null,null,null,null,null,null,null,{"$f":"学校一覧!A22","v":16},{"$f":"学校一覧!B22","v":21},{"$f":"学校一覧!C22","v":13},{"$f":"学校一覧!D22","v":0},{"$f":"学校一覧!E22","v":"広島市立楠那中学校"},{"$f":"学校一覧!F22","v":"34A21"},null,null,null,null,null,0]
[17,null,null,null,null,null,null,null,null,null,null,null,null,null,null,null,null,null,null,null,null,null,null,null,null,null,null,null,null,null,null,{"$f":"学校一覧!A23","v":17},{"$f":"学校一覧!B23","v":22},{"$f":"学校一覧!C23","v":14},{"$f":"学校一覧!D23","v":0},{"$f":"学校一覧!E23","v":"広島市立宇品中学校"},{"$f":"学校一覧!F23","v":"34A22"},null,null,null,null,null,0]
[18,null,null,null,null,null,null,{"$f":"IF(COUNTIF(J19,\"*県*\")=1,1200,100)","v":100},null,null,"円×",null,{"$f":"IF(ISERROR(VLOOKUP($B6,預り証!AF5:AQ400,12,FALSE))=FALSE,VLOOKUP($B6,預り証!AF5:AQ400,12,FALSE),\"\")","v":11},null,null,"名分",null,null,null,null,null,null,null,null,null,null,null,null,null,null,null,{"$f":"学校一覧!A24","v":18},{"$f":"学校一覧!B24","v":23},{"$f":"学校一覧!C24","v":15},{"$f":"学校一覧!D24","v":0},{"$f":"学校一覧!E24","v":"広島市立似島中学校"},{"$f":"学校一覧!F24","v":"34A23"},null,null,null,null,null,0]
[19,null,null,null,null,null,null,null,null,null,null,null,null,null,null,null,null,null,null,null,null,null,null,null,null,null,null,null,null,null,null,{"$f":"学校一覧!A25","v":19},{"$f":"学校一覧!B25","v":24},{"$f":"学校一覧!C25","v":16},{"$f":"学校一覧!D25","v":0},{"$f":"学校一覧!E25","v":"広島市立似島学園中学校"},{"$f":"学校一覧!F25","v":"34A24"},null,null,null,null,null,0]
[20,null,null,null,null,"競技名　水泳競技",null,null,null,null,null,null,null,null,null,null,null,null,null,null,null,null,null,null,null,null,null,null,null,null,null,{"$f":"学校一覧!A26","v":20},{"$f":"学校一覧!B26","v":25},{"$f":"学校一覧!C26","v":17},{"$f":"学校一覧!D26","v":0},{"$f":"学校一覧!E26","v":"広島大学附属中学校"},{"$f":"学校一覧!F26","v":"34A25"},null,null,null,null,null,0]
[21,null,null,null,null,null,null,null,{"$f":"\"令和\"&YEAR(TODAY())-2018","v":"令和5"},null,null,5,null,"月",19,null,"日",null,null,null,null,null,null,null,null,null,null,null,null,null,null,{"$f":"学校一覧!A27","v":21},{"$f":"学校一覧!B27","v":26},{"$f":"学校一覧!C27","v":18},{"$f":"学校一覧!D27","v":0},{"$f":"学校一覧!E27","v":"広島大学附属東雲中学校"},{"$f":"学校一覧!F27","v":"34A26"},null,null,null,null,null,0]
[22,null,null,null,null,"参加に伴う大会負担金として，上記金額を預かりました。",null,null,null,null,null,null,null,null,null,null,null,null,null,null,null,null,null,null,null,null,null,null,null,null,null,{"$f":"学校一覧!A28","v":22},{"$f":"学校一覧!B28","v":27},{"$f":"学校一覧!C28","v":19},{"$f":"学校一覧!D28","v":0},{"$f":"学校一覧!E28","v":"比治山女子中学校"},{"$f":"学校一覧!F28","v":34292},null,null,null,null,null,0]
[23,null,null,null,null,null,null,null,null,null,null,null,null,null,null,null,null,null,null,null,null,null,null,null,null,null,null,null,null,null,null,{"$f":"学校一覧!A29","v":23},{"$f":"学校一覧!B29","v":0},{"$f":"学校一覧!C29","v":0},{"$f":"学校一覧!D29","v":0},{"$f":"学校一覧!E29","v":"予備"},{"$f":"学校一覧!F29","v":0},null,null,null,null,null,0]
[24,null,null,"広島市中学校体育連盟　水泳競技専門委員会",null,null,null,null,null,null,null,null,null,null,null,null,null,null,null,null,null,null,null,null,null,null,null,null,null,null,null,{"$f":"学校一覧!A30","v":24},{"$f":"学校一覧!B30","v":0},{"$f":"学校一覧!C30","v":0},{"$f":"学校一覧!D30","v":0},{"$f":"学校一覧!E30","v":"予備"},{"$f":"学校一覧!F30","v":0},null,null,null,null,null,0]
[25,null,null,null,null,null,null,null,null,null,null,null,null,null,null,null,null,null,null,null,null,null,null,null,null,null,null,null,null,null,null,{"$f":"学校一覧!A31","v":25},{"$f":"学校一覧!B31","v":0},{"$f":"学校一覧!C31","v":0},{"$f":"学校一覧!D31","v":0},{"$f":"学校一覧!E31","v":"予備"},{"$f":"学校一覧!F31","v":0},null,null,null,null,null,0]
[26,null,null,null,null,null,null,"専門委員長　",null,null,null,null,"藤田 智行",null,null,null,null,null,null,null,"印",null,null,null,null,null,null,null,null,null,null,{"$f":"学校一覧!A32","v":26},{"$f":"学校一覧!B32","v":9},{"$f":"学校一覧!C32","v":20},{"$f":"学校一覧!D32","v":"広島地区　広島市東区"},{"$f":"学校一覧!E32","v":"広島市立温品中学校"},{"$f":"学校一覧!F32","v":"34A09"},null,null,null,null,null,0]
[27,null,null,null,null,null,null,null,null,null,null,null,null,null,null,null,null,null,null,null,null,null,null,null,null,null,null,null,null,null,null,{"$f":"学校一覧!A33","v":27},{"$f":"学校一覧!B33","v":10},{"$f":"学校一覧!C33","v":21},{"$f":"学校一覧!D33","v":0},{"$f":"学校一覧!E33","v":"広島市立戸坂中学校"},{"$f":"学校一覧!F33","v":"34A10"},null,null,null,null,null,0]
[28,null,null,null,null,null,null,null,null,null,null,null,null,null,null,null,null,null,null,null,null,null,null,null,null,null,null,null,null,null,null,{"$f":"学校一覧!A34","v":28},{"$f":"学校一覧!B34","v":11},{"$f":"学校一覧!C34","v":22},{"$f":"学校一覧!D34","v":0},{"$f":"学校一覧!E34","v":"広島市立牛田中学校"},{"$f":"学校一覧!F34","v":"34A11"},null,null,null,null,null,0]
[29,null,null,null,null,null,null,null,null,null,null,null,null,null,null,null,null,null,null,null,null,null,null,null,null,null,null,null,null,null,null,{"$f":"学校一覧!A35","v":29},{"$f":"学校一覧!B35","v":12},{"$f":"学校一覧!C35","v":23},{"$f":"学校一覧!D35","v":0},{"$f":"学校一覧!E35","v":"広島市立二葉中学校"},{"$f":"学校一覧!F35","v":"34A12"},null,null,null,null,null,0]
[30,null,null,null,null,null,null,null,null,null,null,null,null,null,null,null,null,null,null,null,null,null,null,null,null,null,null,null,null,null,null,{"$f":"学校一覧!A36","v":30},{"$f":"学校一覧!B36","v":13},{"$f":"学校一覧!C36","v":24},{"$f":"学校一覧!D36","v":0},{"$f":"学校一覧!E36","v":"広島市立福木中学校"},{"$f":"学校一覧!F36","v":"34A13"},null,null,null,null,null,0]
[31,{"$f":"B6","v":1},null,null,null,null,null,null,null,null,null,null,null,null,null,null,null,null,null,null,null,null,null,null,null,null,null,null,null,null,null,{"$f":"学校一覧!A37","v":31},{"$f":"学校一覧!B37","v":14},{"$f":"学校一覧!C37","v":25},{"$f":"学校一覧!D37","v":0},{"$f":"学校一覧!E37","v":"広島市立早稲田中学校"},{"$f":"学校一覧!F37","v":"34A14"},null,null,null,null,null,0]
[32,null,null,null,null,null,null,null,null,null,null,null,null,null,null,null,null,null,null,null,null,null,null,null,null,null,null,null,null,null,null,{"$f":"学校一覧!A38","v":32},{"$f":"学校一覧!B38","v":15},{"$f":"学校一覧!C38","v":26},{"$f":"学校一覧!D38","v":0},{"$f":"学校一覧!E38","v":"広島城北中学校"},{"$f":"学校一覧!F38","v":"34A15"},null,null,null,null,null,0]
[33,null,null,null,null,null,null,null,null,null,null,null,null,null,null,null,null,null,null,null,null,null,null,null,null,null,null,null,null,null,null,{"$f":"学校一覧!A39","v":33},{"$f":"学校一覧!B39","v":16},{"$f":"学校一覧!C39","v":27},{"$f":"学校一覧!D39","v":0},{"$f":"学校一覧!E39","v":"広島県立広島中央特別支援学校"},{"$f":"学校一覧!F39","v":0},null,null,null,null,null,0]
[34,null,null,null,"預り証　（専門委員会 控え）",null,null,null,null,null,null,null,null,null,null,null,null,null,null,null,null,null,null,null,null,null,null,null,null,null,null,{"$f":"学校一覧!A40","v":34},{"$f":"学校一覧!B40","v":282},{"$f":"学校一覧!C40","v":28},{"$f":"学校一覧!D40","v":"(準加盟）"},{"$f":"学校一覧!E40","v":"広島朝鮮中級学校"},{"$f":"学校一覧!F40","v":"34A78"},null,null,null,null,null,0]
[35,null,null,null,null,null,null,null,null,null,null,null,null,null,null,null,null,null,null,null,null,null,null,null,null,null,null,null,null,null,null,{"$f":"学校一覧!A41","v":35},{"$f":"学校一覧!B41","v":0},{"$f":"学校一覧!C41","v":0},{"$f":"学校一覧!D41","v":0},{"$f":"学校一覧!E41","v":"予備"},{"$f":"学校一覧!F41","v":0},null,null,null,null,null,0]
[36,null,null,null,null,null,null,null,null,null,null,null,null,null,null,null,null,null,null,null,null,null,null,null,null,null,null,null,null,null,null,{"$f":"学校一覧!A42","v":36},{"$f":"学校一覧!B42","v":0},{"$f":"学校一覧!C42","v":0},{"$f":"学校一覧!D42","v":0},{"$f":"学校一覧!E42","v":"予備"},{"$f":"学校一覧!F42","v":0},null,null,null,null,null,0]
[37,null,null,{"$f":"D12","v":"広島市立幟町中学校長 様"},null,null,null,null,null,null,null,null,null,null,null,null,null,null,null,null,null,null,null,null,null,null,null,null,null,null,null,{"$f":"学校一覧!A43","v":37},{"$f":"学校一覧!B43","v":0},{"$f":"学校一覧!C43","v":0},{"$f":"学校一覧!D43","v":0},{"$f":"学校一覧!E43","v":"予備"},{"$f":"学校一覧!F43","v":0},null,null,null,null,null,0]
[38,null,null,null,null,null,null,null,null,null,null,null,null,null,null,null,null,null,null,null,null,null,null,null,null,null,null,null,null,null,null,{"$f":"学校一覧!A44","v":38},{"$f":"学校一覧!B44","v":65},{"$f":"学校一覧!C44","v":29},{"$f":"学校一覧!D44","v":"広島地区　広島市安芸区"},{"$f":"学校一覧!E44","v":"広島市立瀬野川中学校"},{"$f":"学校一覧!F44","v":"34A63"},null,null,null,null,null,0]
[39,null,null,null,null,null,null,null,null,null,null,null,null,null,null,null,null,null,null,null,null,null,null,null,null,null,null,null,null,null,null,{"$f":"学校一覧!A45","v":39},{"$f":"学校一覧!B45","v":66},{"$f":"学校一覧!C45","v":30},{"$f":"学校一覧!D45","v":0},{"$f":"学校一覧!E45","v":"広島市立阿戸中学校"},{"$f":"学校一覧!F45","v":"34A64"},null,null,null,null,null,0]
[40,null,null,null,null,null,"金",null,{"$f":"I15","v":1100},null,null,null,null,null,null,null,"円",null,null,null,null,null,null,null,null,null,null,null,null,null,null,{"$f":"学校一覧!A46","v":40},{"$f":"学校一覧!B46","v":67},{"$f":"学校一覧!C46","v":31},{"$f":"学校一覧!D46","v":0},{"$f":"学校一覧!E46","v":"広島市立船越中学校"},{"$f":"学校一覧!F46","v":"34A65"},null,null,null,null,null,0]
[41,null,null,null,null,null,null,null,null,null,null,null,null,null,null,null,null,null,null,null,null,null,null,null,null,null,null,null,null,null,null,{"$f":"学校一覧!A47","v":41},{"$f":"学校一覧!B47","v":68},{"$f":"学校一覧!C47","v":32},{"$f":"学校一覧!D47","v":0},{"$f":"学校一覧!E47","v":"広島市立矢野中学校"},{"$f":"学校一覧!F47","v":"34A66"},null,null,null,null,null,0]
[42,null,null,null,null,null,null,null,null,null,null,null,null,null,null,null,null,null,null,null,null,null,null,null,null,null,null,null,null,null,null,{"$f":"学校一覧!A48","v":42},{"$f":"学校一覧!B48","v":69},{"$f":"学校一覧!C48","v":33},{"$f":"学校一覧!D48","v":0},{"$f":"学校一覧!E48","v":"広島市立瀬野川東中学校"},{"$f":"学校一覧!F48","v":"34A67"},null,null,null,null,null,0]
[43,null,null,null,null,null,null,null,null,null,null,null,null,null,null,null,null,null,null,null,null,null,null,null,null,null,null,null,null,null,null,{"$f":"学校一覧!A49","v":43},{"$f":"学校一覧!B49","v":0},{"$f":"学校一覧!C49","v":0},{"$f":"学校一覧!D49","v":0},{"$f":"学校一覧!E49","v":"予備"},{"$f":"学校一覧!F49","v":0},null,null,null,null,null,0]
[44,null,null,"但し，",null,{"$f":"F19","v":"第71回"},null,null,null,{"$f":"J19","v":"広島市中学校総合体育大会（水泳競技の部）"},null,null,null,null,null,null,null,null,null,null,null,null,null,null,null,null,null,null,null,null,null,{"$f":"学校一覧!A50","v":44},{"$f":"学校一覧!B50","v":0},{"$f":"学校一覧!C50","v":0},{"$f":"学校一覧!D50","v":0},{"$f":"学校一覧!E50","v":"予備"},{"$f":"学校一覧!F50","v":0},null,null,null,null,null,0]
[45,null,null,null,null,null,null,null,null,null,null,null,null,null,null,null,null,null,null,null,null,null,null,null,null,null,null,null,null,null,null,{"$f":"学校一覧!A51","v":45},{"$f":"学校一覧!B51","v":0},{"$f":"学校一覧!C51","v":0},{"$f":"学校一覧!D51","v":0},{"$f":"学校一覧!E51","v":"予備"},{"$f":"学校一覧!F51","v":0},null,null,null,null,null,0]
[46,null,null,null,null,"競技名　水泳競技",null,null,null,null,null,null,null,null,null,null,null,null,null,null,null,null,null,null,null,null,null,null,null,null,null,{"$f":"学校一覧!A52","v":46},{"$f":"学校一覧!B52","v":28},{"$f":"学校一覧!C52","v":34},{"$f":"学校一覧!D52","v":"広島地区　広島市西区"},{"$f":"学校一覧!E52","v":"広島市立中広中学校"},{"$f":"学校一覧!F52","v":"34A28"},null,null,null,null,null,0]
[47,null,null,null,null,null,null,null,null,null,null,null,null,null,null,null,null,null,null,null,null,null,null,null,null,null,null,null,null,null,null,{"$f":"学校一覧!A53","v":47},{"$f":"学校一覧!B53","v":29},{"$f":"学校一覧!C53","v":35},{"$f":"学校一覧!D53","v":0},{"$f":"学校一覧!E53","v":"広島市立観音中学校"},{"$f":"学校一覧!F53","v":"34A29"},null,null,null,null,null,0]
[48,null,null,null,null,null,null,{"$f":"H23","v":100},null,null,"円×",null,{"$f":"M23","v":11},null,null,"名分",null,null,null,null,null,null,null,null,null,null,null,null,null,null,null,{"$f":"学校一覧!A54","v":48},{"$f":"学校一覧!B54","v":30},{"$f":"学校一覧!C54","v":36},{"$f":"学校一覧!D54","v":0},{"$f":"学校一覧!E54","v":"広島市立己斐中学校"},{"$f":"学校一覧!F54","v":"34A30"},null,null,null,null,null,0]
[49,null,null,null,null,"参加に伴う大会負担金として，上記金額を預かりました。",null,null,null,null,null,null,null,null,null,null,null,null,null,null,null,null,null,null,null,null,null,null,null,null,null,{"$f":"学校一覧!A55","v":49},{"$f":"学校一覧!B55","v":31},{"$f":"学校一覧!C55","v":37},{"$f":"学校一覧!D55","v":0},{"$f":"学校一覧!E55","v":"広島市立庚午中学校"},{"$f":"学校一覧!F55","v":"34A31"},null,null,null,null,null,0]
[50,null,null,null,null,null,null,null,null,null,null,null,null,null,null,null,null,null,null,null,null,null,null,null,null,null,null,null,null,null,null,{"$f":"学校一覧!A56","v":50},{"$f":"学校一覧!B56","v":32},{"$f":"学校一覧!C56","v":38},{"$f":"学校一覧!D56","v":0},{"$f":"学校一覧!E56","v":"広島市立井口中学校"},{"$f":"学校一覧!F56","v":"34A32"},null,null,null,null,null,0]
[51,null,null,null,null,null,"令和",null,{"$f":"I26","v":"令和5"},null,"年",{"$f":"L26","v":5},null,"月",{"$f":"O26","v":19},null,"日",null,null,null,null,null,null,null,null,null,null,null,null,null,null,{"$f":"学校一覧!A57","v":51},{"$f":"学校一覧!B57","v":33},{"$f":"学校一覧!C57","v":39},{"$f":"学校一覧!D57","v":0},{"$f":"学校一覧!E57","v":"広島市立古田中学校"},{"$f":"学校一覧!F57","v":"34A33"},null,null,null,null,null,0]
[52,null,null,null,null,null,null,null,null,null,null,null,null,null,null,null,null,null,null,null,null,null,null,null,null,null,null,null,null,null,null,{"$f":"学校一覧!A58","v":52},{"$f":"学校一覧!B58","v":34},{"$f":"学校一覧!C58","v":40},{"$f":"学校一覧!D58","v":0},{"$f":"学校一覧!E58","v":"広島市立己斐上中学校"},{"$f":"学校一覧!F58","v":"34A34"},null,null,null,null,null,0]
[53,null,null,null,null,null,null,null,null,null,null,null,null,null,null,null,null,null,null,null,null,null,null,null,null,null,null,null,null,null,null,{"$f":"学校一覧!A59","v":53},{"$f":"学校一覧!B59","v":35},{"$f":"学校一覧!C59","v":41},{"$f":"学校一覧!D59","v":0},{"$f":"学校一覧!E59","v":"広島市立井口台中学校"},{"$f":"学校一覧!F59","v":"34A35"},null,null,null,null,null,0]
[54,null,null,"広島市中学校体育連盟　水泳競技専門委員会",null,null,null,null,null,null,null,null,null,null,null,null,null,null,null,null,null,null,null,null,null,null,null,null,null,null,null,{"$f":"学校一覧!A60","v":54},{"$f":"学校一覧!B60","v":36},{"$f":"学校一覧!C60","v":42},{"$f":"学校一覧!D60","v":0},{"$f":"学校一覧!E60","v":"広島学院中学校"},{"$f":"学校一覧!F60","v":"34A36"},null,null,null,null,null,0]
[55,null,null,null,null,null,null,null,null,null,null,null,null,null,null,null,null,null,null,null,null,null,null,null,null,null,null,null,null,null,null,{"$f":"学校一覧!A61","v":55},{"$f":"学校一覧!B61","v":37},{"$f":"学校一覧!C61","v":43},{"$f":"学校一覧!D61","v":0},{"$f":"学校一覧!E61","v":"崇徳中学校"},{"$f":"学校一覧!F61","v":"34A37"},null,null,null,null,null,0]
[56,null,null,null,null,null,null,"専門委員長　",null,null,null,null,{"$f":"M31","v":"藤田 智行"},null,null,null,null,null,null,null,null,null,null,null,null,null,null,null,null,null,null,{"$f":"学校一覧!A62","v":56},{"$f":"学校一覧!B62","v":38},{"$f":"学校一覧!C62","v":44},{"$f":"学校一覧!D62","v":0},{"$f":"学校一覧!E62","v":"広島修道大学ひろしま協創中学校学校"},{"$f":"学校一覧!F62","v":34003},null,null,null,null,null,0]
[57,null,null,null,null,null,null,null,null,null,null,null,null,null,null,null,null,null,null,null,null,null,null,null,null,null,null,null,null,null,null,{"$f":"学校一覧!A63","v":57},{"$f":"学校一覧!B63","v":39},{"$f":"学校一覧!C63","v":45},{"$f":"学校一覧!D63","v":0},{"$f":"学校一覧!E63","v":"ノートルダム清心中学校"},{"$f":"学校一覧!F63","v":"34A39"},null,null,null,null,null,0]
[58,null,null,null,null,null,null,null,null,null,null,null,null,null,null,null,null,null,null,null,null,null,null,null,null,null,null,null,null,null,null,{"$f":"学校一覧!A64","v":58},{"$f":"学校一覧!B64","v":0},{"$f":"学校一覧!C64","v":0},{"$f":"学校一覧!D64","v":0},{"$f":"学校一覧!E64","v":"予備"},{"$f":"学校一覧!F64","v":0},null,null,null,null,null,0]
[59,null,null,null,null,null,null,null,null,null,null,null,null,null,null,null,null,null,null,null,null,null,null,null,null,null,null,null,null,null,null,{"$f":"学校一覧!A65","v":59},{"$f":"学校一覧!B65","v":0},{"$f":"学校一覧!C65","v":0},{"$f":"学校一覧!D65","v":0},{"$f":"学校一覧!E65","v":"予備"},{"$f":"学校一覧!F65","v":0},null,null,null,null,null,0]
[60,null,null,null,null,null,null,null,null,null,null,null,null,null,null,null,null,null,null,null,null,null,null,null,null,null,null,null,null,null,null,{"$f":"学校一覧!A66","v":60},{"$f":"学校一覧!B66","v":0},{"$f":"学校一覧!C66","v":0},{"$f":"学校一覧!D66","v":0},{"$f":"学校一覧!E66","v":"予備"},{"$f":"学校一覧!F66","v":0},null,null,null,null,null,0]
[61,null,null,null,null,null,null,null,null,null,null,null,null,null,null,null,null,null,null,null,null,null,null,null,null,null,null,null,null,null,null,{"$f":"学校一覧!A67","v":61},{"$f":"学校一覧!B67","v":70},{"$f":"学校一覧!C67","v":46},{"$f":"学校一覧!D67","v":"広島地区　広島市佐伯区"},{"$f":"学校一覧!E67","v":"広島市立三和中学校"},{"$f":"学校一覧!F67","v":"34A68"},null,null,null,null,null,0]
[62,null,null,null,null,null,null,null,null,null,null,null,null,null,null,null,null,null,null,null,null,null,null,null,null,null,null,null,null,null,null,{"$f":"学校一覧!A68","v":62},{"$f":"学校一覧!B68","v":71},{"$f":"学校一覧!C68","v":47},{"$f":"学校一覧!D68","v":0},{"$f":"学校一覧!E68","v":"広島市立五日市観音中学校"},{"$f":"学校一覧!F68","v":"34A69"},null,null,null,null,null,0]
[63,null,null,null,null,null,null,null,null,null,null,null,null,null,null,null,null,null,null,null,null,null,null,null,null,null,null,null,null,null,null,{"$f":"学校一覧!A69","v":63},{"$f":"学校一覧!B69","v":72},{"$f":"学校一覧!C69","v":48},{"$f":"学校一覧!D69","v":0},{"$f":"学校一覧!E69","v":"広島市立五月が丘中学校"},{"$f":"学校一覧!F69","v":"34A70"},null,null,null,null,null,0]
[64,null,null,null,null,null,null,null,null,null,null,null,null,null,null,null,null,null,null,null,null,null,null,null,null,null,null,null,null,null,null,{"$f":"学校一覧!A70","v":64},{"$f":"学校一覧!B70","v":73},{"$f":"学校一覧!C70","v":49},{"$f":"学校一覧!D70","v":0},{"$f":"学校一覧!E70","v":"広島市立美鈴が丘中学校"},{"$f":"学校一覧!F70","v":"34A71"},null,null,null,null,null,0]
[65,null,null,"大会名",null,null,null,null,null,null,null,null,null,null,"各郡市",null,null,null,null,"各郡市委員長",null,null,null,null,null,null,null,null,null,null,null,{"$f":"学校一覧!A71","v":65},{"$f":"学校一覧!B71","v":74},{"$f":"学校一覧!C71","v":50},{"$f":"学校一覧!D71","v":0},{"$f":"学校一覧!E71","v":"広島市立五日市中学校"},{"$f":"学校一覧!F71","v":"34A72"},null,null,null,null,null,0]
[66,null,1,"広島市中学校水泳競技選手権大会",null,null,null,null,null,null,null,null,null,null,"県委員長",null,null,null,null,"今津 賢太郎",null,null,null,null,null,null,null,null,null,null,null,{"$f":"学校一覧!A72","v":66},{"$f":"学校一覧!B72","v":75},{"$f":"学校一覧!C72","v":51},{"$f":"学校一覧!D72","v":0},{"$f":"学校一覧!E72","v":"広島市立五日市南中学校"},{"$f":"学校一覧!F72","v":"34A73"},null,null,null,null,null,{"$f":"SUM(AO71:AP71)","v":0}]
[67,null,2,"広島市中学校新人水泳競技大会",null,null,null,null,null,null,null,null,null,null,"広島市委員長",null,null,null,null,"藤田 智行",null,null,null,null,null,null,null,null,null,null,null,{"$f":"学校一覧!A73","v":67},{"$f":"学校一覧!B73","v":76},{"$f":"学校一覧!C73","v":52},{"$f":"学校一覧!D73","v":0},{"$f":"学校一覧!E73","v":"広島市立城山中学校"},{"$f":"学校一覧!F73","v":"34A74"},null,null,null,null,null,0]
[68,null,3,"広島市中学校総合体育大会（水泳競技の部）",null,null,null,null,null,null,null,null,null,null,"呉市委員長",null,null,null,null,null,null,null,null,null,null,null,null,null,null,null,null,{"$f":"学校一覧!A74","v":68},{"$f":"学校一覧!B74","v":77},{"$f":"学校一覧!C74","v":53},{"$f":"学校一覧!D74","v":0},{"$f":"学校一覧!E74","v":"広島市立湯来中学校"},{"$f":"学校一覧!F74","v":"34A75"},null,null,null,null,null,0]
[69,null,4,null,null,null,null,null,null,null,null,null,null,null,"福山市委員長",null,null,null,null,null,null,null,null,null,null,null,null,null,null,null,null,{"$f":"学校一覧!A75","v":69},{"$f":"学校一覧!B75","v":78},{"$f":"学校一覧!C75","v":54},{"$f":"学校一覧!D75","v":0},{"$f":"学校一覧!E75","v":"広島市立砂谷中学校"},{"$f":"学校一覧!F75","v":"34A76"},null,null,null,null,null,0]
[70,null,5,"広島県中学校水泳競技選手権大会(競泳競技)",null,null,null,null,null,null,null,null,null,null,"大・廿市委員長",null,null,null,null,null,null,null,null,null,null,null,null,null,null,null,null,{"$f":"学校一覧!A76","v":70},{"$f":"学校一覧!B76","v":79},{"$f":"学校一覧!C76","v":55},{"$f":"学校一覧!D76","v":0},{"$f":"学校一覧!E76","v":"広島なぎさ中学校"},{"$f":"学校一覧!F76","v":"34A77"},null,null,null,null,null,0]
[71,null,6,"広島県中学校新人水泳競技大会",null,null,null,null,null,null,null,null,null,null,null,null,null,null,null,null,null,null,null,null,null,null,null,null,null,null,null,{"$f":"学校一覧!A77","v":71},{"$f":"学校一覧!B77","v":0},{"$f":"学校一覧!C77","v":0},{"$f":"学校一覧!D77","v":0},{"$f":"学校一覧!E77","v":"予備"},{"$f":"学校一覧!F77","v":0},null,null,null,null,null,0]
[72,null,7,null,null,null,null,null,null,null,null,null,null,null,null,null,null,null,null,null,null,null,null,null,null,null,null,null,null,null,null,{"$f":"学校一覧!A78","v":72},{"$f":"学校一覧!B78","v":0},{"$f":"学校一覧!C78","v":0},{"$f":"学校一覧!D78","v":0},{"$f":"学校一覧!E78","v":"予備"},{"$f":"学校一覧!F78","v":0},null,null,null,null,null,0]
[73,null,null,null,null,null,null,null,null,null,null,null,null,null,null,null,null,null,null,null,null,null,null,null,null,null,null,null,null,null,null,{"$f":"学校一覧!A79","v":73},{"$f":"学校一覧!B79","v":0},{"$f":"学校一覧!C79","v":0},{"$f":"学校一覧!D79","v":0},{"$f":"学校一覧!E79","v":"予備"},{"$f":"学校一覧!F79","v":0},null,null,null,null,null,0]
[74,null,null,null,null,null,null,null,null,null,null,null,null,null,null,null,null,null,null,null,null,null,null,null,null,null,null,null,null,null,null,{"$f":"学校一覧!A80","v":74},{"$f":"学校一覧!B80","v":40},{"$f":"学校一覧!C80","v":56},{"$f":"学校一覧!D80","v":"広島地区　広島市安佐南区"},{"$f":"学校一覧!E80","v":"広島市立城南中学校"},{"$f":"学校一覧!F80","v":"34A40"},null,null,null,null,null,0]
[75,null,null,null,null,null,null,null,null,null,null,null,null,null,null,null,null,null,null,null,null,null,null,null,null,null,null,null,null,null,null,{"$f":"学校一覧!A81","v":75},{"$f":"学校一覧!B81","v":41},{"$f":"学校一覧!C81","v":57},{"$f":"学校一覧!D81","v":0},{"$f":"学校一覧!E81","v":"広島市立安佐中学校"},{"$f":"学校一覧!F81","v":34108},null,null,null,null,null,0]
[76,null,null,null,null,null,null,null,null,null,null,null,null,null,null,null,null,null,null,null,null,null,null,null,null,null,null,null,null,null,null,{"$f":"学校一覧!A82","v":76},{"$f":"学校一覧!B82","v":42},{"$f":"学校一覧!C82","v":58},{"$f":"学校一覧!D82","v":0},{"$f":"学校一覧!E82","v":"広島市立安西中学校"},{"$f":"学校一覧!F82","v":"34A42"},null,null,null,null,null,0]
[77,null,null,null,null,null,null,null,null,null,null,null,null,null,null,null,null,null,null,null,null,null,null,null,null,null,null,null,null,null,null,{"$f":"学校一覧!A83","v":77},{"$f":"学校一覧!B83","v":43},{"$f":"学校一覧!C83","v":59},{"$f":"学校一覧!D83","v":0},{"$f":"学校一覧!E83","v":"広島市立祇園中学校"},{"$f":"学校一覧!F83","v":"34A43"},null,null,null,null,null,0]
[78,null,null,null,null,null,null,null,null,null,null,null,null,null,null,null,null,null,null,null,null,null,null,null,null,null,null,null,null,null,null,{"$f":"学校一覧!A84","v":78},{"$f":"学校一覧!B84","v":44},{"$f":"学校一覧!C84","v":60},{"$f":"学校一覧!D84","v":0},{"$f":"学校一覧!E84","v":"広島市立祇園東中学校"},{"$f":"学校一覧!F84","v":"34A44"},null,null,null,null,null,0]
[79,null,null,null,null,null,null,null,null,null,null,null,null,null,null,null,null,null,null,null,null,null,null,null,null,null,null,null,null,null,null,{"$f":"学校一覧!A85","v":79},{"$f":"学校一覧!B85","v":45},{"$f":"学校一覧!C85","v":61},{"$f":"学校一覧!D85","v":0},{"$f":"学校一覧!E85","v":"広島市立戸山中学校"},{"$f":"学校一覧!F85","v":"34A45"},null,null,null,null,null,0]
[80,null,null,null,null,null,null,null,null,null,null,null,null,null,"ここまで各郡市",null,null,null,null,"ここまで委員長",null,null,null,null,null,null,null,null,null,null,null,{"$f":"学校一覧!A86","v":80},{"$f":"学校一覧!B86","v":46},{"$f":"学校一覧!C86","v":62},{"$f":"学校一覧!D86","v":0},{"$f":"学校一覧!E86","v":"広島市立伴中学校"},{"$f":"学校一覧!F86","v":"34A46"},null,null,null,null,null,0]
[81,null,null,null,null,null,null,null,null,null,null,null,null,null,null,null,null,null,null,null,null,null,null,null,null,null,null,null,null,null,null,{"$f":"学校一覧!A87","v":81},{"$f":"学校一覧!B87","v":47},{"$f":"学校一覧!C87","v":63},{"$f":"学校一覧!D87","v":0},{"$f":"学校一覧!E87","v":"広島市立安佐南中学校"},{"$f":"学校一覧!F87","v":"34A47"},null,null,null,null,null,0]
[82,null,null,null,null,null,null,null,null,null,null,null,null,null,null,null,null,null,null,null,null,null,null,null,null,null,null,null,null,null,null,{"$f":"学校一覧!A88","v":82},{"$f":"学校一覧!B88","v":48},{"$f":"学校一覧!C88","v":64},{"$f":"学校一覧!D88","v":0},{"$f":"学校一覧!E88","v":"広島市立長束中学校"},{"$f":"学校一覧!F88","v":"34A48"},null,null,null,null,null,0]
[83,null,null,null,null,null,null,null,null,null,null,null,null,null,null,null,null,null,null,null,null,null,null,null,null,null,null,null,null,null,null,{"$f":"学校一覧!A89","v":83},{"$f":"学校一覧!B89","v":49},{"$f":"学校一覧!C89","v":65},{"$f":"学校一覧!D89","v":0},{"$f":"学校一覧!E89","v":"広島市立高取北中学校"},{"$f":"学校一覧!F89","v":"34A49"},null,null,null,null,null,0]
[84,null,null,null,null,null,null,null,null,null,null,null,null,null,null,null,null,null,null,null,null,null,null,null,null,null,null,null,null,null,null,{"$f":"学校一覧!A90","v":84},{"$f":"学校一覧!B90","v":50},{"$f":"学校一覧!C90","v":66},{"$f":"学校一覧!D90","v":0},{"$f":"学校一覧!E90","v":"広島市立城山北中学校"},{"$f":"学校一覧!F90","v":"34A50"},null,null,null,null,null,0]
[85,null,null,null,null,null,null,null,null,null,null,null,null,null,null,null,null,null,null,null,null,null,null,null,null,null,null,null,null,null,null,{"$f":"学校一覧!A91","v":85},{"$f":"学校一覧!B91","v":51},{"$f":"学校一覧!C91","v":67},{"$f":"学校一覧!D91","v":0},{"$f":"学校一覧!E91","v":"広島市立東原中学校"},{"$f":"学校一覧!F91","v":"34A51"},null,null,null,null,null,0]
[86,null,null,null,null,null,null,null,null,null,null,null,null,null,null,null,null,null,null,null,null,null,null,null,null,null,null,null,null,null,null,{"$f":"学校一覧!A92","v":86},{"$f":"学校一覧!B92","v":52},{"$f":"学校一覧!C92","v":68},{"$f":"学校一覧!D92","v":0},{"$f":"学校一覧!E92","v":"広島市立大塚中学校"},{"$f":"学校一覧!F92","v":"34A94"},null,null,null,null,null,0]
[87,null,null,null,null,null,null,null,null,null,null,null,null,null,null,null,null,null,null,null,null,null,null,null,null,null,null,null,null,null,null,{"$f":"学校一覧!A93","v":87},{"$f":"学校一覧!B93","v":53},{"$f":"学校一覧!C93","v":69},{"$f":"学校一覧!D93","v":0},{"$f":"学校一覧!E93","v":"AICJ中学校"},{"$f":"学校一覧!F93","v":"34A95"},null,null,null,null,null,0]
[88,null,null,null,null,null,null,null,null,null,null,null,null,null,null,null,null,null,null,null,null,null,null,null,null,null,null,null,null,null,null,{"$f":"学校一覧!A94","v":88},{"$f":"学校一覧!B94","v":0},{"$f":"学校一覧!C94","v":0},{"$f":"学校一覧!D94","v":0},{"$f":"学校一覧!E94","v":"予備"},{"$f":"学校一覧!F94","v":0},null,null,null,null,null,0]
[89,null,null,null,null,null,null,null,null,null,null,null,null,null,null,null,null,null,null,null,null,null,null,null,null,null,null,null,null,null,null,{"$f":"学校一覧!A95","v":89},{"$f":"学校一覧!B95","v":0},{"$f":"学校一覧!C95","v":0},{"$f":"学校一覧!D95","v":0},{"$f":"学校一覧!E95","v":"予備"},{"$f":"学校一覧!F95","v":0},null,null,null,null,null,0]
[90,null,null,null,null,null,null,null,null,null,null,null,null,null,null,null,null,null,null,null,null,null,null,null,null,null,null,null,null,null,null,{"$f":"学校一覧!A96","v":90},{"$f":"学校一覧!B96","v":0},{"$f":"学校一覧!C96","v":0},{"$f":"学校一覧!D96","v":0},{"$f":"学校一覧!E96","v":"予備"},{"$f":"学校一覧!F96","v":0},null,null,null,null,null,0]
[91,null,null,null,"領　収　書",null,null,null,null,null,null,null,null,null,null,null,null,null,null,null,null,null,null,null,null,null,null,null,null,null,null,{"$f":"学校一覧!A97","v":91},{"$f":"学校一覧!B97","v":54},{"$f":"学校一覧!C97","v":70},{"$f":"学校一覧!D97","v":"広島地区　広島市安佐北区"},{"$f":"学校一覧!E97","v":"広島市立白木中学校"},{"$f":"学校一覧!F97","v":"34A52"},null,null,null,null,null,0]
[92,null,null,null,null,null,null,null,null,null,null,null,null,null,null,null,null,null,null,null,null,null,null,null,null,null,null,null,null,null,null,{"$f":"学校一覧!A98","v":92},{"$f":"学校一覧!B98","v":55},{"$f":"学校一覧!C98","v":71},{"$f":"学校一覧!D98","v":0},{"$f":"学校一覧!E98","v":"広島市立高陽中学校"},{"$f":"学校一覧!F98","v":"34A53"},null,null,null,null,null,0]
[93,null,null,"広島市中学校体育連盟　専門委員長",null,null,null,null,null,null,null,null,null,null,null,null,null,null,null,null,null,null,null,null,null,null,null,null,null,null,null,{"$f":"学校一覧!A99","v":93},{"$f":"学校一覧!B99","v":56},{"$f":"学校一覧!C99","v":72},{"$f":"学校一覧!D99","v":0},{"$f":"学校一覧!E99","v":"広島市立落合中学校"},{"$f":"学校一覧!F99","v":"34A54"},null,null,null,null,null,0]
[94,null,null,{"$f":"T72 &\" 様\"","v":"藤田 智行 様"},null,null,null,null,null,null,null,null,null,null,null,null,null,null,null,null,null,null,null,null,null,null,null,null,null,null,null,{"$f":"学校一覧!A100","v":94},{"$f":"学校一覧!B100","v":57},{"$f":"学校一覧!C100","v":73},{"$f":"学校一覧!D100","v":0},{"$f":"学校一覧!E100","v":"広島市立可部中学校"},{"$f":"学校一覧!F100","v":"34A55"},null,null,null,null,null,0]
[95,null,null,null,null,null,null,null,null,null,null,null,null,null,null,null,null,null,null,null,null,null,null,null,null,null,null,null,null,null,null,{"$f":"学校一覧!A101","v":95},{"$f":"学校一覧!B101","v":58},{"$f":"学校一覧!C101","v":74},{"$f":"学校一覧!D101","v":0},{"$f":"学校一覧!E101","v":"広島市立亀山中学校"},{"$f":"学校一覧!F101","v":"34A56"},null,null,null,null,null,0]
[96,null,null,null,null,null,null,null,null,null,null,null,null,null,null,null,null,null,null,null,null,null,null,null,null,null,null,null,null,null,null,{"$f":"学校一覧!A102","v":96},{"$f":"学校一覧!B102","v":59},{"$f":"学校一覧!C102","v":75},{"$f":"学校一覧!D102","v":0},{"$f":"学校一覧!E102","v":"広島市立清和中学校"},{"$f":"学校一覧!F102","v":"34A57"},null,null,null,null,null,0]
[97,null,null,null,null,null,"金",null,{"$f":"H110*M110","v":1100},null,null,null,null,null,null,null,"円",null,null,null,null,null,null,null,null,null,null,null,null,null,null,{"$f":"学校一覧!A103","v":97},{"$f":"学校一覧!B103","v":60},{"$f":"学校一覧!C103","v":76},{"$f":"学校一覧!D103","v":0},{"$f":"学校一覧!E103","v":"広島市立日浦中学校"},{"$f":"学校一覧!F103","v":"34A58"},null,null,null,null,null,0]
[98,null,null,null,null,null,null,null,null,null,null,null,null,null,null,null,null,null,null,null,null,null,null,null,null,null,null,null,null,null,null,{"$f":"学校一覧!A104","v":98},{"$f":"学校一覧!B104","v":61},{"$f":"学校一覧!C104","v":77},{"$f":"学校一覧!D104","v":0},{"$f":"学校一覧!E104","v":"広島市立亀崎中学校"},{"$f":"学校一覧!F104","v":"34A59"},null,null,null,null,null,0]
[99,null,null,null,null,null,null,null,null,null,null,null,null,null,null,null,null,null,null,null,null,null,null,null,null,null,null,null,null,null,null,{"$f":"学校一覧!A105","v":99},{"$f":"学校一覧!B105","v":62},{"$f":"学校一覧!C105","v":78},{"$f":"学校一覧!D105","v":0},{"$f":"学校一覧!E105","v":"広島市立三入中学校"},{"$f":"学校一覧!F105","v":"34A60"},null,null,null,null,null,0]
[100,null,null,null,null,null,null,null,null,null,null,null,null,null,null,null,null,null,null,null,null,null,null,null,null,null,null,null,null,null,null,{"$f":"学校一覧!A106","v":100},{"$f":"学校一覧!B106","v":63},{"$f":"学校一覧!C106","v":79},{"$f":"学校一覧!D106","v":0},{"$f":"学校一覧!E106","v":"広島市立口田中学校"},{"$f":"学校一覧!F106","v":"34A61"},null,null,null,null,null,0]
[101,null,null,"但し，",null,{"$f":"\"令和\"&YEAR(TODAY())-2018&\"年度\"","v":"令和5年度"},null,null,null,{"$f":"F19&\" \"&J19","v":"第71回 広島市中学校総合体育大会（水泳競技の部）"},null,null,null,null,null,null,null,null,null,null,null,null,null,null,null,null,null,null,null,null,null,{"$f":"学校一覧!A107","v":101},{"$f":"学校一覧!B107","v":64},{"$f":"学校一覧!C107","v":80},{"$f":"学校一覧!D107","v":0},{"$f":"学校一覧!E107","v":"広島市立安佐北中学校"},{"$f":"学校一覧!F107","v":"34A62"},null,null,null,null,null,0]
[102,null,null,null,null,null,null,null,null,null,null,null,null,null,null,null,null,null,null,null,null,null,null,null,null,null,null,null,null,null,null,{"$f":"学校一覧!A108","v":102},{"$f":"学校一覧!B108","v":0},{"$f":"学校一覧!C108","v":0},{"$f":"学校一覧!D108","v":0},{"$f":"学校一覧!E108","v":"予備"},{"$f":"学校一覧!F108","v":0},null,null,null,null,null,0]
[103,null,null,null,null,"競技名　水泳競技",null,null,null,null,null,null,null,null,null,null,null,null,null,null,null,null,null,null,null,null,null,null,null,null,null,{"$f":"学校一覧!A109","v":103},{"$f":"学校一覧!B109","v":0},{"$f":"学校一覧!C109","v":0},{"$f":"学校一覧!D109","v":0},{"$f":"学校一覧!E109","v":"予備"},{"$f":"学校一覧!F109","v":0},null,null,null,null,null,0]
[104,null,null,null,null,null,null,null,null,null,null,null,null,null,null,null,null,null,null,null,null,null,null,null,null,null,null,null,null,null,null,{"$f":"学校一覧!A110","v":104},{"$f":"学校一覧!B110","v":0},{"$f":"学校一覧!C110","v":0},{"$f":"学校一覧!D110","v":0},{"$f":"学校一覧!E110","v":"予備"},{"$f":"学校一覧!F110","v":0},null,null,null,null,null,0]
[105,null,null,null,null,null,null,{"$f":"H53","v":100},null,null,"円×",null,{"$f":"AQ3","v":11},null,null,"名分",null,null,null,null,null,null,null,null,null,null,null,null,null,null,null,{"$f":"学校一覧!A111","v":105},{"$f":"学校一覧!B111","v":80},{"$f":"学校一覧!C111","v":81},{"$f":"学校一覧!D111","v":"広島地区　大竹市・廿日市市"},{"$f":"学校一覧!E111","v":"廿日市市立廿日市中学校"},{"$f":"学校一覧!F111","v":"34A79"},null,null,null,null,null,0]
[106,null,null,null,null,"参加に伴う大会負担金として上記金額を正に領収しました。",null,null,null,null,null,null,null,null,null,null,null,null,null,null,null,null,null,null,null,null,null,null,null,null,null,{"$f":"学校一覧!A112","v":106},{"$f":"学校一覧!B112","v":81},{"$f":"学校一覧!C112","v":82},{"$f":"学校一覧!D112","v":0},{"$f":"学校一覧!E112","v":"廿日市市立七尾中学校"},{"$f":"学校一覧!F112","v":"34A80"},null,null,null,null,null,0]
[107,null,null,null,null,null,null,null,null,null,null,null,null,null,null,null,null,null,null,null,null,null,null,null,null,null,null,null,null,null,null,{"$f":"学校一覧!A113","v":107},{"$f":"学校一覧!B113","v":82},{"$f":"学校一覧!C113","v":83},{"$f":"学校一覧!D113","v":0},{"$f":"学校一覧!E113","v":"廿日市市立阿品台中学校"},{"$f":"学校一覧!F113","v":"34A81"},null,null,null,null,null,0]
[108,null,null,null,null,null,"令和",null,null,null,"年",null,null,"月",null,null,"日",null,null,null,null,null,null,null,null,null,null,null,null,null,null,{"$f":"学校一覧!A114","v":108},{"$f":"学校一覧!B114","v":83},{"$f":"学校一覧!C114","v":84},{"$f":"学校一覧!D114","v":0},{"$f":"学校一覧!E114","v":"廿日市市立野坂中学校"},{"$f":"学校一覧!F114","v":"34A82"},null,null,null,null,null,0]
[109,null,null,null,null,null,null,null,null,null,null,null,null,null,null,null,null,null,null,null,null,null,null,null,null,null,null,null,null,null,null,{"$f":"学校一覧!A115","v":109},{"$f":"学校一覧!B115","v":84},{"$f":"学校一覧!C115","v":85},{"$f":"学校一覧!D115","v":0},{"$f":"学校一覧!E115","v":"廿日市市立四季が丘中学校"},{"$f":"学校一覧!F115","v":"34A83"},null,null,null,null,null,0]
[110,null,null,null,null,null,null,null,null,null,null,null,null,null,null,null,null,null,null,null,null,null,null,null,null,null,null,null,null,null,null,{"$f":"学校一覧!A116","v":110},{"$f":"学校一覧!B116","v":85},{"$f":"学校一覧!C116","v":86},{"$f":"学校一覧!D116","v":0},{"$f":"学校一覧!E116","v":"廿日市市立佐伯中学校"},{"$f":"学校一覧!F116","v":"34A84"},null,null,null,null,null,0]
[111,null,null,null,null,null,null,"広島市中学校体育連盟",null,null,null,null,null,null,null,null,null,null,null,null,null,null,null,null,null,null,null,null,null,null,null,{"$f":"学校一覧!A117","v":111},{"$f":"学校一覧!B117","v":86},{"$f":"学校一覧!C117","v":87},{"$f":"学校一覧!D117","v":0},{"$f":"学校一覧!E117","v":"廿日市市立吉和中学校"},{"$f":"学校一覧!F117","v":"34A85"},null,null,null,null,null,0]
[112,null,null,null,null,null,null,null,null,null,null,null,null,null,null,null,null,null,null,null,null,null,null,null,null,null,null,null,null,null,null,{"$f":"学校一覧!A118","v":112},{"$f":"学校一覧!B118","v":87},{"$f":"学校一覧!C118","v":88},{"$f":"学校一覧!D118","v":0},{"$f":"学校一覧!E118","v":"廿日市立大野中学校"},{"$f":"学校一覧!F118","v":"34A91"},null,null,null,null,null,0]
[113,null,null,null,null,null,null,"会長",null,null,null,null,null,null,null,null,null,null,null,"印",null,null,null,null,null,null,null,null,null,null,null,{"$f":"学校一覧!A119","v":113},{"$f":"学校一覧!B119","v":88},{"$f":"学校一覧!C119","v":89},{"$f":"学校一覧!D119","v":0},{"$f":"学校一覧!E119","v":"廿日市立大野東中学校"},{"$f":"学校一覧!F119","v":"34A92"},null,null,null,null,null,0]
[114,null,null,null,null,null,null,null,null,null,null,null,null,null,null,null,null,null,null,null,null,null,null,null,null,null,null,null,null,null,null,{"$f":"学校一覧!A120","v":114},{"$f":"学校一覧!B120","v":89},{"$f":"学校一覧!C120","v":90},{"$f":"学校一覧!D120","v":0},{"$f":"学校一覧!E120","v":"廿日市立宮島中学校"},{"$f":"学校一覧!F120","v":"34A93"},null,null,null,null,null,0]
[115,null,null,null,null,null,null,null,null,null,null,null,null,null,null,null,null,null,null,null,null,null,null,null,null,null,null,null,null,null,null,{"$f":"学校一覧!A121","v":115},{"$f":"学校一覧!B121","v":90},{"$f":"学校一覧!C121","v":91},{"$f":"学校一覧!D121","v":0},{"$f":"学校一覧!E121","v":"山陽女学園中等部"},{"$f":"学校一覧!F121","v":"34A86"},null,null,null,null,null,0]
[116,null,null,null,null,null,null,null,null,null,null,null,null,null,null,null,null,null,null,null,null,null,null,null,null,null,null,null,null,null,null,{"$f":"学校一覧!A122","v":116},{"$f":"学校一覧!B122","v":91},{"$f":"学校一覧!C122","v":92},{"$f":"学校一覧!D122","v":0},{"$f":"学校一覧!E122","v":"大竹市立玖波中学校"},{"$f":"学校一覧!F122","v":"34A87"},null,null,null,null,null,0]
[117,null,null,null,null,null,null,null,null,null,null,null,null,null,null,null,null,null,null,null,null,null,null,null,null,null,null,null,null,null,null,{"$f":"学校一覧!A123","v":117},{"$f":"学校一覧!B123","v":92},{"$f":"学校一覧!C123","v":93},{"$f":"学校一覧!D123","v":0},{"$f":"学校一覧!E123","v":"大竹市立小方中学校"},{"$f":"学校一覧!F123","v":"34A88"},null,null,null,null,null,0]
[118,null,null,null,null,null,null,null,null,null,null,null,null,null,null,null,null,null,null,null,null,null,null,null,null,null,null,null,null,null,null,{"$f":"学校一覧!A124","v":118},{"$f":"学校一覧!B124","v":93},{"$f":"学校一覧!C124","v":94},{"$f":"学校一覧!D124","v":0},{"$f":"学校一覧!E124","v":"大竹市立大竹中学校"},{"$f":"学校一覧!F124","v":"34A89"},null,null,null,null,null,0]
[119,null,null,null,null,null,null,null,null,null,null,null,null,null,null,null,null,null,null,null,null,null,null,null,null,null,null,null,null,null,null,{"$f":"学校一覧!A125","v":119},{"$f":"学校一覧!B125","v":94},{"$f":"学校一覧!C125","v":95},{"$f":"学校一覧!D125","v":0},{"$f":"学校一覧!E125","v":"大竹市立栗谷中学校"},{"$f":"学校一覧!F125","v":"34A90"},null,null,null,null,null,0]
[120,null,null,null,null,null,null,null,null,null,null,null,null,null,null,null,null,null,null,null,null,null,null,null,null,null,null,null,null,null,null,{"$f":"学校一覧!A126","v":120},{"$f":"学校一覧!B126","v":0},{"$f":"学校一覧!C126","v":0},{"$f":"学校一覧!D126","v":0},{"$f":"学校一覧!E126","v":"予備"},{"$f":"学校一覧!F126","v":0},null,null,null,null,null,0]
[121,null,null,null,null,null,null,null,null,null,null,null,null,null,null,null,null,null,null,null,null,null,null,null,null,null,null,null,null,null,null,{"$f":"学校一覧!A127","v":121},{"$f":"学校一覧!B127","v":0},{"$f":"学校一覧!C127","v":0},{"$f":"学校一覧!D127","v":0},{"$f":"学校一覧!E127","v":"予備"},{"$f":"学校一覧!F127","v":0},null,null,null,null,null,0]
[122,null,null,null,null,null,null,null,null,null,null,null,null,null,null,null,null,null,null,null,null,null,null,null,null,null,null,null,null,null,null,{"$f":"学校一覧!A128","v":122},{"$f":"学校一覧!B128","v":0},{"$f":"学校一覧!C128","v":0},{"$f":"学校一覧!D128","v":0},{"$f":"学校一覧!E128","v":"予備"},{"$f":"学校一覧!F128","v":0},null,null,null,null,null,0]
[123,null,null,null,null,null,null,null,null,null,null,null,null,null,null,null,null,null,null,null,null,null,null,null,null,null,null,null,null,null,null,{"$f":"学校一覧!A129","v":123},{"$f":"学校一覧!B129","v":95},{"$f":"学校一覧!C129","v":96},{"$f":"学校一覧!D129","v":"芸北地区　山県郡"},{"$f":"学校一覧!E129","v":"安芸太田町立加計中学校"},{"$f":"学校一覧!F129","v":0},null,null,null,null,null,0]
[124,null,null,null,null,null,null,null,null,1,2,3,4,5,6,7,8,9,10,null,null,null,null,null,null,null,null,null,null,null,null,{"$f":"学校一覧!A130","v":124},{"$f":"学校一覧!B130","v":96},{"$f":"学校一覧!C130","v":97},{"$f":"学校一覧!D130","v":0},{"$f":"学校一覧!E130","v":"安芸太田町立筒賀中学校"},{"$f":"学校一覧!F130","v":0},null,null,null,null,null,0]
[125,null,null,null,null,null,null,null,null,null,null,null,null,null,"市総体","県中",null,null,"県新人",null,null,null,null,null,null,null,null,null,null,null,null,{"$f":"学校一覧!A131","v":125},{"$f":"学校一覧!B131","v":97},{"$f":"学校一覧!C131","v":98},{"$f":"学校一覧!D131","v":0},{"$f":"学校一覧!E131","v":"安芸太田町立戸河内中学校"},{"$f":"学校一覧!F131","v":0},null,null,null,null,null,0]
[126,null,null,null,null,null,"元号1",null,null,"年","年齢",null,"西暦","皇紀",null,"回数",null,null,"回数",null,null,null,null,null,null,null,null,null,null,null,null,{"$f":"学校一覧!A132","v":126},{"$f":"学校一覧!B132","v":98},{"$f":"学校一覧!C132","v":99},{"$f":"学校一覧!D132","v":0},{"$f":"学校一覧!E132","v":"北広島町立芸北中学校"},{"$f":"学校一覧!F132","v":0},null,null,null,null,null,0]
[127,null,null,null,null,null,"令和",null,null,4,62,null,2022,2682,70,62,null,null,2,null,null,null,null,null,null,null,null,null,null,null,null,{"$f":"学校一覧!A133","v":127},{"$f":"学校一覧!B133","v":99},{"$f":"学校一覧!C133","v":100},{"$f":"学校一覧!D133","v":0},{"$f":"学校一覧!E133","v":"北広島町立豊平中学校"},{"$f":"学校一覧!F133","v":0},null,null,null,null,null,0]
[128,null,null,null,null,null,"令和",null,null,5,63,null,2023,2683,71,63,null,null,3,null,null,null,null,null,null,null,null,null,null,null,null,{"$f":"学校一覧!A134","v":128},{"$f":"学校一覧!B134","v":100},{"$f":"学校一覧!C134","v":101},{"$f":"学校一覧!D134","v":0},{"$f":"学校一覧!E134","v":"北広島町立大朝中学校"},{"$f":"学校一覧!F134","v":0},null,null,null,null,null,0]
[129,null,null,null,null,null,"令和",null,null,6,64,null,2024,2684,72,64,null,null,4,null,null,null,null,null,null,null,null,null,null,null,null,{"$f":"学校一覧!A135","v":129},{"$f":"学校一覧!B135","v":101},{"$f":"学校一覧!C135","v":102},{"$f":"学校一覧!D135","v":0},{"$f":"学校一覧!E135","v":"北広島町立千代田中学校"},{"$f":"学校一覧!F135","v":0},null,null,null,null,null,0]
[130,null,null,null,null,null,"令和",null,null,7,65,null,2025,2685,73,65,null,null,5,null,null,null,null,null,null,null,null,null,null,null,null,{"$f":"学校一覧!A136","v":130},{"$f":"学校一覧!B136","v":102},{"$f":"学校一覧!C136","v":103},{"$f":"学校一覧!D136","v":0},{"$f":"学校一覧!E136","v":"広島新庄中学校"},{"$f":"学校一覧!F136","v":0},null,null,null,null,null,{"$f":"SUM(AO135:AP135)","v":0}]
[131,null,null,null,null,null,"令和",null,null,8,66,null,2026,2686,74,66,null,null,6,null,null,null,null,null,null,null,null,null,null,null,null,{"$f":"学校一覧!A137","v":131},{"$f":"学校一覧!B137","v":0},{"$f":"学校一覧!C137","v":0},{"$f":"学校一覧!D137","v":0},{"$f":"学校一覧!E137","v":"予備"},{"$f":"学校一覧!F137","v":0},null,null,null,null,null,0]
[132,null,null,null,null,null,"令和",null,null,9,67,null,2027,2687,75,67,null,null,7,null,null,null,null,null,null,null,null,null,null,null,null,{"$f":"学校一覧!A138","v":132},{"$f":"学校一覧!B138","v":0},{"$f":"学校一覧!C138","v":0},{"$f":"学校一覧!D138","v":0},{"$f":"学校一覧!E138","v":"予備"},{"$f":"学校一覧!F138","v":0},null,null,null,null,null,0]
[133,null,null,null,null,null,"令和",null,null,10,68,null,2028,2688,76,68,null,null,8,null,null,null,null,null,null,null,null,null,null,null,null,{"$f":"学校一覧!A139","v":133},{"$f":"学校一覧!B139","v":0},{"$f":"学校一覧!C139","v":0},{"$f":"学校一覧!D139","v":0},{"$f":"学校一覧!E139","v":"予備"},{"$f":"学校一覧!F139","v":0},null,null,null,null,null,0]
[134,null,null,null,null,null,"令和",null,null,11,69,null,2029,2689,77,69,null,null,9,null,null,null,null,null,null,null,null,null,null,null,null,{"$f":"学校一覧!A140","v":134},{"$f":"学校一覧!B140","v":103},{"$f":"学校一覧!C140","v":104},{"$f":"学校一覧!D140","v":"芸北地区　安芸高田市"},{"$f":"学校一覧!E140","v":"安芸高田市立吉田中学校"},{"$f":"学校一覧!F140","v":0},null,null,null,null,null,0]
[135,null,null,null,null,null,"令和",null,null,12,70,null,2030,2690,78,70,null,null,10,null,null,null,null,null,null,null,null,null,null,null,null,{"$f":"学校一覧!A141","v":135},{"$f":"学校一覧!B141","v":104},{"$f":"学校一覧!C141","v":105},{"$f":"学校一覧!D141","v":0},{"$f":"学校一覧!E141","v":"安芸高田市立八千代中学校"},{"$f":"学校一覧!F141","v":0},null,null,null,null,null,0]
[136,null,null,null,null,null,"令和",null,null,13,71,null,2031,2691,79,71,null,null,11,null,null,null,null,null,null,null,null,null,null,null,null,{"$f":"学校一覧!A142","v":136},{"$f":"学校一覧!B142","v":105},{"$f":"学校一覧!C142","v":106},{"$f":"学校一覧!D142","v":0},{"$f":"学校一覧!E142","v":"安芸高田市立美土里中学校"},{"$f":"学校一覧!F142","v":0},null,null,null,null,null,0]
[137,null,null,null,null,null,"令和",null,null,14,72,null,2032,2692,80,72,null,null,12,null,null,null,null,null,null,null,null,null,null,null,null,{"$f":"学校一覧!A143","v":137},{"$f":"学校一覧!B143","v":106},{"$f":"学校一覧!C143","v":107},{"$f":"学校一覧!D143","v":0},{"$f":"学校一覧!E143","v":"安芸高田市立高宮中学校"},{"$f":"学校一覧!F143","v":0},null,null,null,null,null,0]
[138,null,null,null,null,null,"令和",null,null,15,73,null,2033,2693,81,73,null,null,13,null,null,null,null,null,null,null,null,null,null,null,null,{"$f":"学校一覧!A144","v":138},{"$f":"学校一覧!B144","v":107},{"$f":"学校一覧!C144","v":108},{"$f":"学校一覧!D144","v":0},{"$f":"学校一覧!E144","v":"安芸高田市立甲田中学校"},{"$f":"学校一覧!F144","v":0},null,null,null,null,null,0]
[139,null,null,null,null,null,"令和",null,null,16,74,null,2034,2694,82,74,null,null,14,null,null,null,null,null,null,null,null,null,null,null,null,{"$f":"学校一覧!A145","v":139},{"$f":"学校一覧!B145","v":108},{"$f":"学校一覧!C145","v":109},{"$f":"学校一覧!D145","v":0},{"$f":"学校一覧!E145","v":"安芸高田市立向原中学校"},{"$f":"学校一覧!F145","v":0},null,null,null,null,null,0]
[140,null,null,null,null,null,"令和",null,null,17,75,null,2035,2695,83,75,null,null,15,null,null,null,null,null,null,null,null,null,null,null,null,{"$f":"学校一覧!A146","v":140},{"$f":"学校一覧!B146","v":0},{"$f":"学校一覧!C146","v":0},{"$f":"学校一覧!D146","v":0},{"$f":"学校一覧!E146","v":"予備"},{"$f":"学校一覧!F146","v":0},null,null,null,null,null,0]
[141,null,null,null,null,null,"令和",null,null,18,76,null,2036,2696,84,76,null,null,16,null,null,null,null,null,null,null,null,null,null,null,null,{"$f":"学校一覧!A147","v":141},{"$f":"学校一覧!B147","v":0},{"$f":"学校一覧!C147","v":0},{"$f":"学校一覧!D147","v":0},{"$f":"学校一覧!E147","v":"予備"},{"$f":"学校一覧!F147","v":0},null,null,null,null,null,0]
[142,null,null,null,null,null,"令和",null,null,19,77,null,2037,2697,85,77,null,null,17,null,null,null,null,null,null,null,null,null,null,null,null,{"$f":"学校一覧!A148","v":142},{"$f":"学校一覧!B148","v":0},{"$f":"学校一覧!C148","v":0},{"$f":"学校一覧!D148","v":0},{"$f":"学校一覧!E148","v":"予備"},{"$f":"学校一覧!F148","v":0},null,null,null,null,null,0]
[143,null,null,null,null,null,"令和",null,null,20,78,null,2038,2698,86,78,null,null,18,null,null,null,null,null,null,null,null,null,null,null,null,{"$f":"学校一覧!A149","v":143},{"$f":"学校一覧!B149","v":109},{"$f":"学校一覧!C149","v":110},{"$f":"学校一覧!D149","v":"呉・賀茂地区　呉市"},{"$f":"学校一覧!E149","v":"呉市立仁方中学校"},{"$f":"学校一覧!F149","v":"34C01"},null,null,null,null,null,0]
[144,null,null,null,null,null,"令和",null,null,21,79,null,2039,2699,87,79,null,null,19,null,null,null,null,null,null,null,null,null,null,null,null,{"$f":"学校一覧!A150","v":144},{"$f":"学校一覧!B150","v":110},{"$f":"学校一覧!C150","v":111},{"$f":"学校一覧!D150","v":0},{"$f":"学校一覧!E150","v":"呉市立広南中学校"},{"$f":"学校一覧!F150","v":"34C02"},null,null,null,null,null,0]
[145,null,null,null,null,null,"令和",null,null,22,80,null,2040,2700,88,80,null,null,20,null,null,null,null,null,null,null,null,null,null,null,null,{"$f":"学校一覧!A151","v":145},{"$f":"学校一覧!B151","v":111},{"$f":"学校一覧!C151","v":112},{"$f":"学校一覧!D151","v":0},{"$f":"学校一覧!E151","v":"呉市立白岳中学校"},{"$f":"学校一覧!F151","v":"34C03"},null,null,null,null,null,0]
[146,null,null,null,null,null,"令和",null,null,23,81,null,2041,2701,89,81,null,null,21,null,null,null,null,null,null,null,null,null,null,null,null,{"$f":"学校一覧!A152","v":146},{"$f":"学校一覧!B152","v":112},{"$f":"学校一覧!C152","v":113},{"$f":"学校一覧!D152","v":0},{"$f":"学校一覧!E152","v":"呉市立広中央中学校"},{"$f":"学校一覧!F152","v":"34C04"},null,null,null,null,null,0]
[147,null,null,null,null,null,"令和",null,null,24,82,null,2042,2702,90,82,null,null,22,null,null,null,null,null,null,null,null,null,null,null,null,{"$f":"学校一覧!A153","v":147},{"$f":"学校一覧!B153","v":113},{"$f":"学校一覧!C153","v":114},{"$f":"学校一覧!D153","v":0},{"$f":"学校一覧!E153","v":"呉市立郷原中学校"},{"$f":"学校一覧!F153","v":"34C05"},null,null,null,null,null,0]
[148,null,null,null,null,null,"令和",null,null,25,83,null,2043,2703,91,83,null,null,23,null,null,null,null,null,null,null,null,null,null,null,null,{"$f":"学校一覧!A154","v":148},{"$f":"学校一覧!B154","v":114},{"$f":"学校一覧!C154","v":115},{"$f":"学校一覧!D154","v":0},{"$f":"学校一覧!E154","v":"呉市立横路中学校"},{"$f":"学校一覧!F154","v":"34C06"},null,null,null,null,null,0]
[149,null,null,null,null,null,"令和",null,null,26,84,null,2044,2704,92,84,null,null,24,null,null,null,null,null,null,null,null,null,null,null,null,{"$f":"学校一覧!A155","v":149},{"$f":"学校一覧!B155","v":115},{"$f":"学校一覧!C155","v":116},{"$f":"学校一覧!D155","v":0},{"$f":"学校一覧!E155","v":"呉市立阿賀中学校"},{"$f":"学校一覧!F155","v":"34C07"},null,null,null,null,null,0]
[150,null,null,null,null,null,"令和",null,null,27,85,null,2045,2705,93,85,null,null,25,null,null,null,null,null,null,null,null,null,null,null,null,{"$f":"学校一覧!A156","v":150},{"$f":"学校一覧!B156","v":116},{"$f":"学校一覧!C156","v":117},{"$f":"学校一覧!D156","v":0},{"$f":"学校一覧!E156","v":"呉市立大冠中学校（休校）"},{"$f":"学校一覧!F156","v":0},null,null,null,null,null,0]
[151,null,null,null,null,null,"令和",null,null,28,86,null,2046,2706,94,86,null,null,26,null,null,null,null,null,null,null,null,null,null,null,null,{"$f":"学校一覧!A157","v":151},{"$f":"学校一覧!B157","v":117},{"$f":"学校一覧!C157","v":118},{"$f":"学校一覧!D157","v":0},{"$f":"学校一覧!E157","v":"呉市立警固屋中学校"},{"$f":"学校一覧!F157","v":"34C09"},null,null,null,null,null,0]
[152,null,null,null,null,null,"令和",null,null,29,87,null,2047,2707,95,87,null,null,27,null,null,null,null,null,null,null,null,null,null,null,null,{"$f":"学校一覧!A158","v":152},{"$f":"学校一覧!B158","v":118},{"$f":"学校一覧!C158","v":119},{"$f":"学校一覧!D158","v":0},{"$f":"学校一覧!E158","v":"呉市立宮原中学校"},{"$f":"学校一覧!F158","v":"34C10"},null,null,null,null,null,0]
[153,null,null,null,null,null,"令和",null,null,30,88,null,2048,2708,96,88,null,null,28,null,null,null,null,null,null,null,null,null,null,null,null,{"$f":"学校一覧!A159","v":153},{"$f":"学校一覧!B159","v":119},{"$f":"学校一覧!C159","v":120},{"$f":"学校一覧!D159","v":0},{"$f":"学校一覧!E159","v":"呉市立和庄中学校"},{"$f":"学校一覧!F159","v":"34C11"},null,null,null,null,null,0]
[154,null,null,null,null,null,"令和",null,null,31,89,null,2049,2709,97,89,null,null,29,null,null,null,null,null,null,null,null,null,null,null,null,{"$f":"学校一覧!A160","v":154},{"$f":"学校一覧!B160","v":120},{"$f":"学校一覧!C160","v":121},{"$f":"学校一覧!D160","v":0},{"$f":"学校一覧!E160","v":"呉市立東畑中学校"},{"$f":"学校一覧!F160","v":"34C12"},null,null,null,null,null,0]
[155,null,null,null,null,null,"令和",null,null,32,90,null,2050,2710,98,90,null,null,30,null,null,null,null,null,null,null,null,null,null,null,null,{"$f":"学校一覧!A161","v":155},{"$f":"学校一覧!B161","v":121},{"$f":"学校一覧!C161","v":122},{"$f":"学校一覧!D161","v":0},{"$f":"学校一覧!E161","v":"呉市立片山中学校"},{"$f":"学校一覧!F161","v":"34C13"},null,null,null,null,null,0]
[156,null,null,null,null,null,"令和",null,null,33,91,null,2051,2711,99,91,null,null,31,null,null,null,null,null,null,null,null,null,null,null,null,{"$f":"学校一覧!A162","v":156},{"$f":"学校一覧!B162","v":122},{"$f":"学校一覧!C162","v":123},{"$f":"学校一覧!D162","v":0},{"$f":"学校一覧!E162","v":"呉市立呉中央中学校"},{"$f":"学校一覧!F162","v":"34C14"},null,null,null,null,null,0]
[157,null,null,null,null,null,"令和",null,null,34,92,null,2052,2712,100,92,null,null,32,null,null,null,null,null,null,null,null,null,null,null,null,{"$f":"学校一覧!A163","v":157},{"$f":"学校一覧!B163","v":123},{"$f":"学校一覧!C163","v":124},{"$f":"学校一覧!D163","v":0},{"$f":"学校一覧!E163","v":"呉市立両城中学校"},{"$f":"学校一覧!F163","v":"34C15"},null,null,null,null,null,0]
[158,null,null,null,null,null,"令和",null,null,35,93,null,2053,2713,101,93,null,null,33,null,null,null,null,null,null,null,null,null,null,null,null,{"$f":"学校一覧!A164","v":158},{"$f":"学校一覧!B164","v":124},{"$f":"学校一覧!C164","v":125},{"$f":"学校一覧!D164","v":0},{"$f":"学校一覧!E164","v":"呉市立吉浦中学校"},{"$f":"学校一覧!F164","v":"34C16"},null,null,null,null,null,0]
[159,null,null,null,null,null,"令和",null,null,36,94,null,2054,2714,102,94,null,null,34,null,null,null,null,null,null,null,null,null,null,null,null,{"$f":"学校一覧!A165","v":159},{"$f":"学校一覧!B165","v":125},{"$f":"学校一覧!C165","v":126},{"$f":"学校一覧!D165","v":0},{"$f":"学校一覧!E165","v":"呉市立天応中学校"},{"$f":"学校一覧!F165","v":"34C17"},null,null,null,null,null,0]
[160,null,null,null,null,null,"令和",null,null,37,95,null,2055,2715,103,95,null,null,35,null,null,null,null,null,null,null,null,null,null,null,null,{"$f":"学校一覧!A166","v":160},{"$f":"学校一覧!B166","v":126},{"$f":"学校一覧!C166","v":127},{"$f":"学校一覧!D166","v":0},{"$f":"学校一覧!E166","v":"呉市立昭和中学校"},{"$f":"学校一覧!F166","v":"34C18"},null,null,null,null,null,0]
[161,null,null,null,null,null,"令和",null,null,38,96,null,2056,2716,104,96,null,null,36,null,null,null,null,null,null,null,null,null,null,null,null,{"$f":"学校一覧!A167","v":161},{"$f":"学校一覧!B167","v":127},{"$f":"学校一覧!C167","v":128},{"$f":"学校一覧!D167","v":0},{"$f":"学校一覧!E167","v":"呉市立昭和北中学校"},{"$f":"学校一覧!F167","v":"34C19"},null,null,null,null,null,0]
[162,null,null,null,null,null,"令和",null,null,39,97,null,2057,2717,105,97,null,null,37,null,null,null,null,null,null,null,null,null,null,null,null,{"$f":"学校一覧!A168","v":162},{"$f":"学校一覧!B168","v":128},{"$f":"学校一覧!C168","v":129},{"$f":"学校一覧!D168","v":0},{"$f":"学校一覧!E168","v":"呉青山中学校"},{"$f":"学校一覧!F168","v":"34C20"},null,null,null,null,null,0]
[163,null,null,null,null,null,"令和",null,null,40,98,null,2058,2718,106,98,null,null,38,null,null,null,null,null,null,null,null,null,null,null,null,{"$f":"学校一覧!A169","v":163},{"$f":"学校一覧!B169","v":129},{"$f":"学校一覧!C169","v":130},{"$f":"学校一覧!D169","v":0},{"$f":"学校一覧!E169","v":"呉市立下蒲刈中学校"},{"$f":"学校一覧!F169","v":"34C21"},null,null,null,null,null,0]
[164,null,null,null,null,null,"令和",null,null,41,99,null,2059,2719,107,99,null,null,39,null,null,null,null,null,null,null,null,null,null,null,null,{"$f":"学校一覧!A170","v":164},{"$f":"学校一覧!B170","v":130},{"$f":"学校一覧!C170","v":131},{"$f":"学校一覧!D170","v":0},{"$f":"学校一覧!E170","v":"呉市立川尻中学校"},{"$f":"学校一覧!F170","v":"34C22"},null,null,null,null,null,0]
[165,null,null,null,null,null,"令和",null,null,42,100,null,2060,2720,108,100,null,null,40,null,null,null,null,null,null,null,null,null,null,null,null,{"$f":"学校一覧!A171","v":165},{"$f":"学校一覧!B171","v":131},{"$f":"学校一覧!C171","v":132},{"$f":"学校一覧!D171","v":0},{"$f":"学校一覧!E171","v":"呉市立安浦中学校"},{"$f":"学校一覧!F171","v":"34C23"},null,null,null,null,null,0]
[166,null,null,null,null,null,"令和",null,null,43,101,null,2061,2721,109,101,null,null,41,null,null,null,null,null,null,null,null,null,null,null,null,{"$f":"学校一覧!A172","v":166},{"$f":"学校一覧!B172","v":132},{"$f":"学校一覧!C172","v":133},{"$f":"学校一覧!D172","v":0},{"$f":"学校一覧!E172","v":"呉市立豊浜中学校"},{"$f":"学校一覧!F172","v":"34C24"},null,null,null,null,null,0]
[167,null,null,null,null,null,"令和",null,null,44,102,null,2062,2722,110,102,null,null,42,null,null,null,null,null,null,null,null,null,null,null,null,{"$f":"学校一覧!A173","v":167},{"$f":"学校一覧!B173","v":133},{"$f":"学校一覧!C173","v":134},{"$f":"学校一覧!D173","v":0},{"$f":"学校一覧!E173","v":"呉市立豊中学校"},{"$f":"学校一覧!F173","v":"34C25"},null,null,null,null,null,0]
[168,null,null,null,null,null,"令和",null,null,45,103,null,2063,2723,111,103,null,null,43,null,null,null,null,null,null,null,null,null,null,null,null,{"$f":"学校一覧!A174","v":168},{"$f":"学校一覧!B174","v":134},{"$f":"学校一覧!C174","v":135},{"$f":"学校一覧!D174","v":0},{"$f":"学校一覧!E174","v":"呉市立音戸中学校"},{"$f":"学校一覧!F174","v":"34C26"},null,null,null,null,null,0]
[169,null,null,null,null,null,"令和",null,null,46,104,null,2064,2724,112,104,null,null,44,null,null,null,null,null,null,null,null,null,null,null,null,{"$f":"学校一覧!A175","v":169},{"$f":"学校一覧!B175","v":135},{"$f":"学校一覧!C175","v":136},{"$f":"学校一覧!D175","v":0},{"$f":"学校一覧!E175","v":"呉市立明徳中学校"},{"$f":"学校一覧!F175","v":"34C27"},null,null,null,null,null,0]
[170,null,null,null,null,null,null,null,null,null,null,null,null,null,null,null,null,null,null,null,null,null,null,null,null,null,null,null,null,null,null,{"$f":"学校一覧!A176","v":170},{"$f":"学校一覧!B176","v":136},{"$f":"学校一覧!C176","v":137},{"$f":"学校一覧!D176","v":0},{"$f":"学校一覧!E176","v":"呉市立倉橋中学校"},{"$f":"学校一覧!F176","v":"34C28"},null,null,null,null,null,0]
[171,null,null,null,null,null,null,null,null,null,null,null,null,null,null,null,null,null,null,null,null,null,null,null,null,null,null,null,null,null,null,{"$f":"学校一覧!A177","v":171},{"$f":"学校一覧!B177","v":137},{"$f":"学校一覧!C177","v":138},{"$f":"学校一覧!D177","v":0},{"$f":"学校一覧!E177","v":"呉市立蒲刈中学校"},{"$f":"学校一覧!F177","v":"34C30"},null,null,null,null,null,0]
[172,null,null,null,null,null,null,null,null,null,null,null,null,null,null,null,null,null,null,null,null,null,null,null,null,null,null,null,null,null,null,{"$f":"学校一覧!A178","v":172},{"$f":"学校一覧!B178","v":0},{"$f":"学校一覧!C178","v":0},{"$f":"学校一覧!D178","v":0},{"$f":"学校一覧!E178","v":"予備"},{"$f":"学校一覧!F178","v":0},null,null,null,null,null,0]
[173,null,null,null,null,null,null,null,null,null,null,null,null,null,null,null,null,null,null,null,null,null,null,null,null,null,null,null,null,null,null,{"$f":"学校一覧!A179","v":173},{"$f":"学校一覧!B179","v":0},{"$f":"学校一覧!C179","v":0},{"$f":"学校一覧!D179","v":0},{"$f":"学校一覧!E179","v":"予備"},{"$f":"学校一覧!F179","v":0},null,null,null,null,null,0]
[174,null,null,null,null,null,null,null,null,null,null,null,null,null,null,null,null,null,null,null,null,null,null,null,null,null,null,null,null,null,null,{"$f":"学校一覧!A180","v":174},{"$f":"学校一覧!B180","v":0},{"$f":"学校一覧!C180","v":0},{"$f":"学校一覧!D180","v":0},{"$f":"学校一覧!E180","v":"予備"},{"$f":"学校一覧!F180","v":0},null,null,null,null,null,0]
[175,null,null,null,null,null,null,null,null,null,null,null,null,null,null,null,null,null,null,null,null,null,null,null,null,null,null,null,null,null,null,{"$f":"学校一覧!A181","v":175},{"$f":"学校一覧!B181","v":138},{"$f":"学校一覧!C181","v":139},{"$f":"学校一覧!D181","v":"呉・賀茂地区　安芸郡"},{"$f":"学校一覧!E181","v":"府中町立府中中学校"},{"$f":"学校一覧!F181","v":"34C31"},null,null,null,null,null,0]
[176,null,null,null,null,null,null,null,null,null,null,null,null,null,null,null,null,null,null,null,null,null,null,null,null,null,null,null,null,null,null,{"$f":"学校一覧!A182","v":176},{"$f":"学校一覧!B182","v":139},{"$f":"学校一覧!C182","v":140},{"$f":"学校一覧!D182","v":0},{"$f":"学校一覧!E182","v":"府中町立府中緑ヶ丘中学校"},{"$f":"学校一覧!F182","v":"34C32"},null,null,null,null,null,0]
[177,null,null,null,null,null,null,null,null,null,null,null,null,null,null,null,null,null,null,null,null,null,null,null,null,null,null,null,null,null,null,{"$f":"学校一覧!A183","v":177},{"$f":"学校一覧!B183","v":140},{"$f":"学校一覧!C183","v":141},{"$f":"学校一覧!D183","v":0},{"$f":"学校一覧!E183","v":"海田町立海田中学校"},{"$f":"学校一覧!F183","v":"34C33"},null,null,null,null,null,0]
[178,null,null,null,null,null,null,null,null,null,null,null,null,null,null,null,null,null,null,null,null,null,null,null,null,null,null,null,null,null,null,{"$f":"学校一覧!A184","v":178},{"$f":"学校一覧!B184","v":141},{"$f":"学校一覧!C184","v":142},{"$f":"学校一覧!D184","v":0},{"$f":"学校一覧!E184","v":"海田町立海田西中学校"},{"$f":"学校一覧!F184","v":"34C34"},null,null,null,null,null,0]
[179,null,null,null,null,null,null,null,null,null,null,null,null,null,null,null,null,null,null,null,null,null,null,null,null,null,null,null,null,null,null,{"$f":"学校一覧!A185","v":179},{"$f":"学校一覧!B185","v":142},{"$f":"学校一覧!C185","v":143},{"$f":"学校一覧!D185","v":0},{"$f":"学校一覧!E185","v":"熊野町立熊野中学校"},{"$f":"学校一覧!F185","v":"34C35"},null,null,null,null,null,0]
[180,null,null,null,null,null,null,null,null,null,null,null,null,null,null,null,null,null,null,null,null,null,null,null,null,null,null,null,null,null,null,{"$f":"学校一覧!A186","v":180},{"$f":"学校一覧!B186","v":143},{"$f":"学校一覧!C186","v":144},{"$f":"学校一覧!D186","v":0},{"$f":"学校一覧!E186","v":"熊野町立熊野東中学校"},{"$f":"学校一覧!F186","v":"34C36"},null,null,null,null,null,0]
[181,null,null,null,null,null,null,null,null,null,null,null,null,null,null,null,null,null,null,null,null,null,null,null,null,null,null,null,null,null,null,{"$f":"学校一覧!A187","v":181},{"$f":"学校一覧!B187","v":144},{"$f":"学校一覧!C187","v":145},{"$f":"学校一覧!D187","v":0},{"$f":"学校一覧!E187","v":"坂町立坂中学校"},{"$f":"学校一覧!F187","v":"34C37"},null,null,null,null,null,0]
[182,null,null,null,null,null,null,null,null,null,null,null,null,null,null,null,null,null,null,null,null,null,null,null,null,null,null,null,null,null,null,{"$f":"学校一覧!A188","v":182},{"$f":"学校一覧!B188","v":0},{"$f":"学校一覧!C188","v":0},{"$f":"学校一覧!D188","v":0},{"$f":"学校一覧!E188","v":"予備"},{"$f":"学校一覧!F188","v":0},null,null,null,null,null,0]
[183,null,null,null,null,null,null,null,null,null,null,null,null,null,null,null,null,null,null,null,null,null,null,null,null,null,null,null,null,null,null,{"$f":"学校一覧!A189","v":183},{"$f":"学校一覧!B189","v":0},{"$f":"学校一覧!C189","v":0},{"$f":"学校一覧!D189","v":0},{"$f":"学校一覧!E189","v":"予備"},{"$f":"学校一覧!F189","v":0},null,null,null,null,null,0]
[184,null,null,null,null,null,null,null,null,null,null,null,null,null,null,null,null,null,null,null,null,null,null,null,null,null,null,null,null,null,null,{"$f":"学校一覧!A190","v":184},{"$f":"学校一覧!B190","v":0},{"$f":"学校一覧!C190","v":0},{"$f":"学校一覧!D190","v":0},{"$f":"学校一覧!E190","v":"予備"},{"$f":"学校一覧!F190","v":0},null,null,null,null,null,0]
[185,null,null,null,null,null,null,null,null,null,null,null,null,null,null,null,null,null,null,null,null,null,null,null,null,null,null,null,null,null,null,{"$f":"学校一覧!A191","v":185},{"$f":"学校一覧!B191","v":145},{"$f":"学校一覧!C191","v":146},{"$f":"学校一覧!D191","v":"呉・賀茂地区　江田島市"},{"$f":"学校一覧!E191","v":"江田島市立江田島中学校"},{"$f":"学校一覧!F191","v":"34C39"},null,null,null,null,null,0]
[186,null,null,null,null,null,null,null,null,null,null,null,null,null,null,null,null,null,null,null,null,null,null,null,null,null,null,null,null,null,null,{"$f":"学校一覧!A192","v":186},{"$f":"学校一覧!B192","v":146},{"$f":"学校一覧!C192","v":147},{"$f":"学校一覧!D192","v":0},{"$f":"学校一覧!E192","v":"江田島市立能美中学校"},{"$f":"学校一覧!F192","v":"34C40"},null,null,null,null,null,0]
[187,null,null,null,null,null,null,null,null,null,null,null,null,null,null,null,null,null,null,null,null,null,null,null,null,null,null,null,null,null,null,{"$f":"学校一覧!A193","v":187},{"$f":"学校一覧!B193","v":147},{"$f":"学校一覧!C193","v":148},{"$f":"学校一覧!D193","v":0},{"$f":"学校一覧!E193","v":"江田島市立三高中学校"},{"$f":"学校一覧!F193","v":"34C41"},null,null,null,null,null,0]
[188,null,null,null,null,null,null,null,null,null,null,null,null,null,null,null,null,null,null,null,null,null,null,null,null,null,null,null,null,null,null,{"$f":"学校一覧!A194","v":188},{"$f":"学校一覧!B194","v":148},{"$f":"学校一覧!C194","v":149},{"$f":"学校一覧!D194","v":0},{"$f":"学校一覧!E194","v":"江田島市立大柿中学校"},{"$f":"学校一覧!F194","v":"34C43"},null,null,null,null,null,0]
[189,null,null,null,null,null,null,null,null,null,null,null,null,null,null,null,null,null,null,null,null,null,null,null,null,null,null,null,null,null,null,{"$f":"学校一覧!A195","v":189},{"$f":"学校一覧!B195","v":0},{"$f":"学校一覧!C195","v":0},{"$f":"学校一覧!D195","v":0},{"$f":"学校一覧!E195","v":"予備"},{"$f":"学校一覧!F195","v":0},null,null,null,null,null,0]
[190,null,null,null,null,null,null,null,null,null,null,null,null,null,null,null,null,null,null,null,null,null,null,null,null,null,null,null,null,null,null,{"$f":"学校一覧!A196","v":190},{"$f":"学校一覧!B196","v":0},{"$f":"学校一覧!C196","v":0},{"$f":"学校一覧!D196","v":0},{"$f":"学校一覧!E196","v":"予備"},{"$f":"学校一覧!F196","v":0},null,null,null,null,null,0]
[191,null,null,null,null,null,null,null,null,null,null,null,null,null,null,null,null,null,null,null,null,null,null,null,null,null,null,null,null,null,null,{"$f":"学校一覧!A197","v":191},{"$f":"学校一覧!B197","v":0},{"$f":"学校一覧!C197","v":0},{"$f":"学校一覧!D197","v":0},{"$f":"学校一覧!E197","v":"予備"},{"$f":"学校一覧!F197","v":0},null,null,null,null,null,0]
[192,null,null,null,null,null,null,null,null,null,null,null,null,null,null,null,null,null,null,null,null,null,null,null,null,null,null,null,null,null,null,{"$f":"学校一覧!A198","v":192},{"$f":"学校一覧!B198","v":149},{"$f":"学校一覧!C198","v":150},{"$f":"学校一覧!D198","v":"呉・賀茂地区　東広島市"},{"$f":"学校一覧!E198","v":"東広島市立西条中学校"},{"$f":"学校一覧!F198","v":"34C44"},null,null,null,null,null,0]
[193,null,null,null,null,null,null,null,null,null,null,null,null,null,null,null,null,null,null,null,null,null,null,null,null,null,null,null,null,null,null,{"$f":"学校一覧!A199","v":193},{"$f":"学校一覧!B199","v":150},{"$f":"学校一覧!C199","v":151},{"$f":"学校一覧!D199","v":0},{"$f":"学校一覧!E199","v":"東広島市立向陽中学校"},{"$f":"学校一覧!F199","v":"34C45"},null,null,null,null,null,0]
[194,null,null,null,null,null,null,null,null,null,null,null,null,null,null,null,null,null,null,null,null,null,null,null,null,null,null,null,null,null,null,{"$f":"学校一覧!A200","v":194},{"$f":"学校一覧!B200","v":151},{"$f":"学校一覧!C200","v":152},{"$f":"学校一覧!D200","v":0},{"$f":"学校一覧!E200","v":"東広島市立八本松中学校"},{"$f":"学校一覧!F200","v":"34C46"},null,null,null,null,null,{"$f":"SUM(AO199:AP199)","v":0}]
[195,null,null,null,null,null,null,null,null,null,null,null,null,null,null,null,null,null,null,null,null,null,null,null,null,null,null,null,null,null,null,{"$f":"学校一覧!A201","v":195},{"$f":"学校一覧!B201","v":152},{"$f":"学校一覧!C201","v":153},{"$f":"学校一覧!D201","v":0},{"$f":"学校一覧!E201","v":"東広島市立志和中学校"},{"$f":"学校一覧!F201","v":0},null,null,null,null,null,0]
[196,null,null,null,null,null,null,null,null,null,null,null,null,null,null,null,null,null,null,null,null,null,null,null,null,null,null,null,null,null,null,{"$f":"学校一覧!A202","v":196},{"$f":"学校一覧!B202","v":153},{"$f":"学校一覧!C202","v":154},{"$f":"学校一覧!D202","v":0},{"$f":"学校一覧!E202","v":"東広島市立高屋中学校"},{"$f":"学校一覧!F202","v":"34C48"},null,null,null,null,null,0]
[197,null,null,null,null,null,null,null,null,null,null,null,null,null,null,null,null,null,null,null,null,null,null,null,null,null,null,null,null,null,null,{"$f":"学校一覧!A203","v":197},{"$f":"学校一覧!B203","v":154},{"$f":"学校一覧!C203","v":155},{"$f":"学校一覧!D203","v":0},{"$f":"学校一覧!E203","v":"東広島市立磯松中学校"},{"$f":"学校一覧!F203","v":"34C49"},null,null,null,null,null,0]
[198,null,null,null,null,null,null,null,null,null,null,null,null,null,null,null,null,null,null,null,null,null,null,null,null,null,null,null,null,null,null,{"$f":"学校一覧!A204","v":198},{"$f":"学校一覧!B204","v":155},{"$f":"学校一覧!C204","v":156},{"$f":"学校一覧!D204","v":0},{"$f":"学校一覧!E204","v":"東広島市立松賀中学校"},{"$f":"学校一覧!F204","v":"34C50"},null,null,null,null,null,0]
[199,null,null,null,null,null,null,null,null,null,null,null,null,null,null,null,null,null,null,null,null,null,null,null,null,null,null,null,null,null,null,{"$f":"学校一覧!A205","v":199},{"$f":"学校一覧!B205","v":156},{"$f":"学校一覧!C205","v":157},{"$f":"学校一覧!D205","v":0},{"$f":"学校一覧!E205","v":"東広島市立高美が丘中学校"},{"$f":"学校一覧!F205","v":"34C51"},null,null,null,null,null,0]
[200,null,null,null,null,null,null,null,null,null,null,null,null,null,null,null,null,null,null,null,null,null,null,null,null,null,null,null,null,null,null,{"$f":"学校一覧!A206","v":200},{"$f":"学校一覧!B206","v":157},{"$f":"学校一覧!C206","v":158},{"$f":"学校一覧!D206","v":0},{"$f":"学校一覧!E206","v":"東広島市立黒瀬中学校"},{"$f":"学校一覧!F206","v":"34C52"},null,null,null,null,null,0]
[201,null,null,null,null,null,null,null,null,null,null,null,null,null,null,null,null,null,null,null,null,null,null,null,null,null,null,null,null,null,null,{"$f":"学校一覧!A207","v":201},{"$f":"学校一覧!B207","v":158},{"$f":"学校一覧!C207","v":159},{"$f":"学校一覧!D207","v":0},{"$f":"学校一覧!E207","v":"東広島市立福富中学校"},{"$f":"学校一覧!F207","v":"34C53"},null,null,null,null,null,0]
[202,null,null,null,null,null,null,null,null,null,null,null,null,null,null,null,null,null,null,null,null,null,null,null,null,null,null,null,null,null,null,{"$f":"学校一覧!A208","v":202},{"$f":"学校一覧!B208","v":159},{"$f":"学校一覧!C208","v":160},{"$f":"学校一覧!D208","v":0},{"$f":"学校一覧!E208","v":"東広島市立豊栄中学校"},{"$f":"学校一覧!F208","v":"34C54"},null,null,null,null,null,0]
[203,null,null,null,null,null,null,null,null,null,null,null,null,null,null,null,null,null,null,null,null,null,null,null,null,null,null,null,null,null,null,{"$f":"学校一覧!A209","v":203},{"$f":"学校一覧!B209","v":160},{"$f":"学校一覧!C209","v":161},{"$f":"学校一覧!D209","v":0},{"$f":"学校一覧!E209","v":"東広島市立河内中学校"},{"$f":"学校一覧!F209","v":"34C55"},null,null,null,null,null,0]
[204,null,null,null,null,null,null,null,null,null,null,null,null,null,null,null,null,null,null,null,null,null,null,null,null,null,null,null,null,null,null,{"$f":"学校一覧!A210","v":204},{"$f":"学校一覧!B210","v":161},{"$f":"学校一覧!C210","v":162},{"$f":"学校一覧!D210","v":0},{"$f":"学校一覧!E210","v":"東広島市立安芸津中学校"},{"$f":"学校一覧!F210","v":"34C56"},null,null,null,null,null,0]
[205,null,null,null,null,null,null,null,null,null,null,null,null,null,null,null,null,null,null,null,null,null,null,null,null,null,null,null,null,null,null,{"$f":"学校一覧!A211","v":205},{"$f":"学校一覧!B211","v":162},{"$f":"学校一覧!C211","v":163},{"$f":"学校一覧!D211","v":0},{"$f":"学校一覧!E211","v":"東広島市立中央中学校"},{"$f":"学校一覧!F211","v":"34C60"},null,null,null,null,null,0]
[206,null,null,null,null,null,null,null,null,null,null,null,null,null,null,null,null,null,null,null,null,null,null,null,null,null,null,null,null,null,null,{"$f":"学校一覧!A212","v":206},{"$f":"学校一覧!B212","v":163},{"$f":"学校一覧!C212","v":164},{"$f":"学校一覧!D212","v":0},{"$f":"学校一覧!E212","v":"武田中学校"},{"$f":"学校一覧!F212","v":"34C57"},null,null,null,null,null,0]
[207,null,null,null,null,null,null,null,null,null,null,null,null,null,null,null,null,null,null,null,null,null,null,null,null,null,null,null,null,null,null,{"$f":"学校一覧!A213","v":207},{"$f":"学校一覧!B213","v":164},{"$f":"学校一覧!C213","v":165},{"$f":"学校一覧!D213","v":0},{"$f":"学校一覧!E213","v":"近畿大学附属東広島中学校"},{"$f":"学校一覧!F213","v":"34C58"},null,null,null,null,null,0]
[208,null,null,null,null,null,null,null,null,null,null,null,null,null,null,null,null,null,null,null,null,null,null,null,null,null,null,null,null,null,null,{"$f":"学校一覧!A214","v":208},{"$f":"学校一覧!B214","v":165},{"$f":"学校一覧!C214","v":166},{"$f":"学校一覧!D214","v":0},{"$f":"学校一覧!E214","v":"広島県立広島中学校"},{"$f":"学校一覧!F214","v":"34C59"},null,null,null,null,null,0]
[209,null,null,null,null,null,null,null,null,null,null,null,null,null,null,null,null,null,null,null,null,null,null,null,null,null,null,null,null,null,null,{"$f":"学校一覧!A215","v":209},{"$f":"学校一覧!B215","v":0},{"$f":"学校一覧!C215","v":0},{"$f":"学校一覧!D215","v":0},{"$f":"学校一覧!E215","v":"予備"},{"$f":"学校一覧!F215","v":0},null,null,null,null,null,0]
[210,null,null,null,null,null,null,null,null,null,null,null,null,null,null,null,null,null,null,null,null,null,null,null,null,null,null,null,null,null,null,{"$f":"学校一覧!A216","v":210},{"$f":"学校一覧!B216","v":0},{"$f":"学校一覧!C216","v":0},{"$f":"学校一覧!D216","v":0},{"$f":"学校一覧!E216","v":"予備"},{"$f":"学校一覧!F216","v":0},null,null,null,null,null,0]
[211,null,null,null,null,null,null,null,null,null,null,null,null,null,null,null,null,null,null,null,null,null,null,null,null,null,null,null,null,null,null,{"$f":"学校一覧!A217","v":211},{"$f":"学校一覧!B217","v":0},{"$f":"学校一覧!C217","v":0},{"$f":"学校一覧!D217","v":0},{"$f":"学校一覧!E217","v":"予備"},{"$f":"学校一覧!F217","v":0},null,null,null,null,null,0]
[212,null,null,null,null,null,null,null,null,null,null,null,null,null,null,null,null,null,null,null,null,null,null,null,null,null,null,null,null,null,null,{"$f":"学校一覧!A218","v":212},{"$f":"学校一覧!B218","v":166},{"$f":"学校一覧!C218","v":167},{"$f":"学校一覧!D218","v":"南部地区　尾道市"},{"$f":"学校一覧!E218","v":"尾道市立久保中学校"},{"$f":"学校一覧!F218","v":"34D01"},null,null,null,null,null,0]
[213,null,null,null,null,null,null,null,null,null,null,null,null,null,null,null,null,null,null,null,null,null,null,null,null,null,null,null,null,null,null,{"$f":"学校一覧!A219","v":213},{"$f":"学校一覧!B219","v":167},{"$f":"学校一覧!C219","v":168},{"$f":"学校一覧!D219","v":0},{"$f":"学校一覧!E219","v":"尾道市立長江中学校"},{"$f":"学校一覧!F219","v":"34D02"},null,null,null,null,null,0]
[214,null,null,null,null,null,null,null,null,null,null,null,null,null,null,null,null,null,null,null,null,null,null,null,null,null,null,null,null,null,null,{"$f":"学校一覧!A220","v":214},{"$f":"学校一覧!B220","v":168},{"$f":"学校一覧!C220","v":169},{"$f":"学校一覧!D220","v":0},{"$f":"学校一覧!E220","v":"尾道市立栗原中学校"},{"$f":"学校一覧!F220","v":"34D03"},null,null,null,null,null,0]
[215,null,null,null,null,null,null,null,null,null,null,null,null,null,null,null,null,null,null,null,null,null,null,null,null,null,null,null,null,null,null,{"$f":"学校一覧!A221","v":215},{"$f":"学校一覧!B221","v":169},{"$f":"学校一覧!C221","v":170},{"$f":"学校一覧!D221","v":0},{"$f":"学校一覧!E221","v":"尾道市立吉和中学校"},{"$f":"学校一覧!F221","v":"34D04"},null,null,null,null,null,0]
[216,null,null,null,null,null,null,null,null,null,null,null,null,null,null,null,null,null,null,null,null,null,null,null,null,null,null,null,null,null,null,{"$f":"学校一覧!A222","v":216},{"$f":"学校一覧!B222","v":170},{"$f":"学校一覧!C222","v":171},{"$f":"学校一覧!D222","v":0},{"$f":"学校一覧!E222","v":"尾道市立日比崎中学校"},{"$f":"学校一覧!F222","v":"34D05"},null,null,null,null,null,0]
[217,null,null,null,null,null,null,null,null,null,null,null,null,null,null,null,null,null,null,null,null,null,null,null,null,null,null,null,null,null,null,{"$f":"学校一覧!A223","v":217},{"$f":"学校一覧!B223","v":171},{"$f":"学校一覧!C223","v":172},{"$f":"学校一覧!D223","v":0},{"$f":"学校一覧!E223","v":"尾道市立美木中学校"},{"$f":"学校一覧!F223","v":"34D06"},null,null,null,null,null,0]
[218,null,null,null,null,null,null,null,null,null,null,null,null,null,null,null,null,null,null,null,null,null,null,null,null,null,null,null,null,null,null,{"$f":"学校一覧!A224","v":218},{"$f":"学校一覧!B224","v":172},{"$f":"学校一覧!C224","v":173},{"$f":"学校一覧!D224","v":0},{"$f":"学校一覧!E224","v":"尾道市立原田中学校"},{"$f":"学校一覧!F224","v":"34D07"},null,null,null,null,null,0]
[219,null,null,null,null,null,null,null,null,null,null,null,null,null,null,null,null,null,null,null,null,null,null,null,null,null,null,null,null,null,null,{"$f":"学校一覧!A225","v":219},{"$f":"学校一覧!B225","v":173},{"$f":"学校一覧!C225","v":174},{"$f":"学校一覧!D225","v":0},{"$f":"学校一覧!E225","v":"尾道市立高西中学校"},{"$f":"学校一覧!F225","v":"34D08"},null,null,null,null,null,0]
[220,null,null,null,null,null,null,null,null,null,null,null,null,null,null,null,null,null,null,null,null,null,null,null,null,null,null,null,null,null,null,{"$f":"学校一覧!A226","v":220},{"$f":"学校一覧!B226","v":174},{"$f":"学校一覧!C226","v":175},{"$f":"学校一覧!D226","v":0},{"$f":"学校一覧!E226","v":"尾道市立百島中学校"},{"$f":"学校一覧!F226","v":"34D09"},null,null,null,null,null,0]
[221,null,null,null,null,null,null,null,null,null,null,null,null,null,null,null,null,null,null,null,null,null,null,null,null,null,null,null,null,null,null,{"$f":"学校一覧!A227","v":221},{"$f":"学校一覧!B227","v":175},{"$f":"学校一覧!C227","v":176},{"$f":"学校一覧!D227","v":0},{"$f":"学校一覧!E227","v":"尾道市立浦崎中学校"},{"$f":"学校一覧!F227","v":"34D10"},null,null,null,null,null,0]
[222,null,null,null,null,null,null,null,null,null,null,null,null,null,null,null,null,null,null,null,null,null,null,null,null,null,null,null,null,null,null,{"$f":"学校一覧!A228","v":222},{"$f":"学校一覧!B228","v":176},{"$f":"学校一覧!C228","v":177},{"$f":"学校一覧!D228","v":0},{"$f":"学校一覧!E228","v":"尾道市立向東中学校"},{"$f":"学校一覧!F228","v":"34D11"},null,null,null,null,null,0]
[223,null,null,null,null,null,null,null,null,null,null,null,null,null,null,null,null,null,null,null,null,null,null,null,null,null,null,null,null,null,null,{"$f":"学校一覧!A229","v":223},{"$f":"学校一覧!B229","v":177},{"$f":"学校一覧!C229","v":178},{"$f":"学校一覧!D229","v":0},{"$f":"学校一覧!E229","v":"尾道市立御調中学校"},{"$f":"学校一覧!F229","v":"34D12"},null,null,null,null,null,0]
[224,null,null,null,null,null,null,null,null,null,null,null,null,null,null,null,null,null,null,null,null,null,null,null,null,null,null,null,null,null,null,{"$f":"学校一覧!A230","v":224},{"$f":"学校一覧!B230","v":178},{"$f":"学校一覧!C230","v":179},{"$f":"学校一覧!D230","v":0},{"$f":"学校一覧!E230","v":"尾道市立向島中学校"},{"$f":"学校一覧!F230","v":"34D13"},null,null,null,null,null,0]
[225,null,null,null,null,null,null,null,null,null,null,null,null,null,null,null,null,null,null,null,null,null,null,null,null,null,null,null,null,null,null,{"$f":"学校一覧!A231","v":225},{"$f":"学校一覧!B231","v":179},{"$f":"学校一覧!C231","v":180},{"$f":"学校一覧!D231","v":0},{"$f":"学校一覧!E231","v":"尾道市立因島南中学校"},{"$f":"学校一覧!F231","v":"34D28"},null,null,null,null,null,0]
[226,null,null,null,null,null,null,null,null,null,null,null,null,null,null,null,null,null,null,null,null,null,null,null,null,null,null,null,null,null,null,{"$f":"学校一覧!A232","v":226},{"$f":"学校一覧!B232","v":180},{"$f":"学校一覧!C232","v":181},{"$f":"学校一覧!D232","v":0},{"$f":"学校一覧!E232","v":"尾道市立因北中学校"},{"$f":"学校一覧!F232","v":"34D30"},null,null,null,null,null,0]
[227,null,null,null,null,null,null,null,null,null,null,null,null,null,null,null,null,null,null,null,null,null,null,null,null,null,null,null,null,null,null,{"$f":"学校一覧!A233","v":227},{"$f":"学校一覧!B233","v":181},{"$f":"学校一覧!C233","v":182},{"$f":"学校一覧!D233","v":0},{"$f":"学校一覧!E233","v":"尾道市立重井中学校"},{"$f":"学校一覧!F233","v":"34D31"},null,null,null,null,null,0]
[228,null,null,null,null,null,null,null,null,null,null,null,null,null,null,null,null,null,null,null,null,null,null,null,null,null,null,null,null,null,null,{"$f":"学校一覧!A234","v":228},{"$f":"学校一覧!B234","v":182},{"$f":"学校一覧!C234","v":183},{"$f":"学校一覧!D234","v":0},{"$f":"学校一覧!E234","v":"尾道市立瀬戸田中学校"},{"$f":"学校一覧!F234","v":"34D36"},null,null,null,null,null,0]
[229,null,null,null,null,null,null,null,null,null,null,null,null,null,null,null,null,null,null,null,null,null,null,null,null,null,null,null,null,null,null,{"$f":"学校一覧!A235","v":229},{"$f":"学校一覧!B235","v":183},{"$f":"学校一覧!C235","v":184},{"$f":"学校一覧!D235","v":0},{"$f":"学校一覧!E235","v":"尾道中学校"},{"$f":"学校一覧!F235","v":"34D45"},null,null,null,null,null,0]
[230,null,null,null,null,null,null,null,null,null,null,null,null,null,null,null,null,null,null,null,null,null,null,null,null,null,null,null,null,null,null,{"$f":"学校一覧!A236","v":230},{"$f":"学校一覧!B236","v":184},{"$f":"学校一覧!C236","v":185},{"$f":"学校一覧!D236","v":0},{"$f":"学校一覧!E236","v":"広島県立尾道特別支援学校"},{"$f":"学校一覧!F236","v":"34D14"},null,null,null,null,null,0]
[231,null,null,null,null,null,null,null,null,null,null,null,null,null,null,null,null,null,null,null,null,null,null,null,null,null,null,null,null,null,null,{"$f":"学校一覧!A237","v":231},{"$f":"学校一覧!B237","v":0},{"$f":"学校一覧!C237","v":0},{"$f":"学校一覧!D237","v":0},{"$f":"学校一覧!E237","v":"予備"},{"$f":"学校一覧!F237","v":0},null,null,null,null,null,0]
[232,null,null,null,null,null,null,null,null,null,null,null,null,null,null,null,null,null,null,null,null,null,null,null,null,null,null,null,null,null,null,{"$f":"学校一覧!A238","v":232},{"$f":"学校一覧!B238","v":0},{"$f":"学校一覧!C238","v":0},{"$f":"学校一覧!D238","v":0},{"$f":"学校一覧!E238","v":"予備"},{"$f":"学校一覧!F238","v":0},null,null,null,null,null,0]
[233,null,null,null,null,null,null,null,null,null,null,null,null,null,null,null,null,null,null,null,null,null,null,null,null,null,null,null,null,null,null,{"$f":"学校一覧!A239","v":233},{"$f":"学校一覧!B239","v":0},{"$f":"学校一覧!C239","v":0},{"$f":"学校一覧!D239","v":0},{"$f":"学校一覧!E239","v":"予備"},{"$f":"学校一覧!F239","v":0},null,null,null,null,null,0]
[234,null,null,null,null,null,null,null,null,null,null,null,null,null,null,null,null,null,null,null,null,null,null,null,null,null,null,null,null,null,null,{"$f":"学校一覧!A240","v":234},{"$f":"学校一覧!B240","v":185},{"$f":"学校一覧!C240","v":186},{"$f":"学校一覧!D240","v":"南部地区　三原市"},{"$f":"学校一覧!E240","v":"三原市立第一中学校"},{"$f":"学校一覧!F240","v":"34D15"},null,null,null,null,null,0]
[235,null,null,null,null,null,null,null,null,null,null,null,null,null,null,null,null,null,null,null,null,null,null,null,null,null,null,null,null,null,null,{"$f":"学校一覧!A241","v":235},{"$f":"学校一覧!B241","v":186},{"$f":"学校一覧!C241","v":187},{"$f":"学校一覧!D241","v":0},{"$f":"学校一覧!E241","v":"三原市立第二中学校"},{"$f":"学校一覧!F241","v":"34D16"},null,null,null,null,null,0]
[236,null,null,null,null,null,null,null,null,null,null,null,null,null,null,null,null,null,null,null,null,null,null,null,null,null,null,null,null,null,null,{"$f":"学校一覧!A242","v":236},{"$f":"学校一覧!B242","v":187},{"$f":"学校一覧!C242","v":188},{"$f":"学校一覧!D242","v":0},{"$f":"学校一覧!E242","v":"三原市立第三中学校"},{"$f":"学校一覧!F242","v":"34D17"},null,null,null,null,null,0]
[237,null,null,null,null,null,null,null,null,null,null,null,null,null,null,null,null,null,null,null,null,null,null,null,null,null,null,null,null,null,null,{"$f":"学校一覧!A243","v":237},{"$f":"学校一覧!B243","v":188},{"$f":"学校一覧!C243","v":189},{"$f":"学校一覧!D243","v":0},{"$f":"学校一覧!E243","v":"三原市立第四中学校"},{"$f":"学校一覧!F243","v":"34D18"},null,null,null,null,null,0]
[238,null,null,null,null,null,null,null,null,null,null,null,null,null,null,null,null,null,null,null,null,null,null,null,null,null,null,null,null,null,null,{"$f":"学校一覧!A244","v":238},{"$f":"学校一覧!B244","v":189},{"$f":"学校一覧!C244","v":190},{"$f":"学校一覧!D244","v":0},{"$f":"学校一覧!E244","v":"三原市立第五中学校"},{"$f":"学校一覧!F244","v":"34D19"},null,null,null,null,null,0]
[239,null,null,null,null,null,null,null,null,null,null,null,null,null,null,null,null,null,null,null,null,null,null,null,null,null,null,null,null,null,null,{"$f":"学校一覧!A245","v":239},{"$f":"学校一覧!B245","v":190},{"$f":"学校一覧!C245","v":191},{"$f":"学校一覧!D245","v":0},{"$f":"学校一覧!E245","v":"三原市立幸崎中学校"},{"$f":"学校一覧!F245","v":"34D20"},null,null,null,null,null,0]
[240,null,null,null,null,null,null,null,null,null,null,null,null,null,null,null,null,null,null,null,null,null,null,null,null,null,null,null,null,null,null,{"$f":"学校一覧!A246","v":240},{"$f":"学校一覧!B246","v":191},{"$f":"学校一覧!C246","v":192},{"$f":"学校一覧!D246","v":0},{"$f":"学校一覧!E246","v":"三原市立宮浦中学校"},{"$f":"学校一覧!F246","v":"34D22"},null,null,null,null,null,0]
[241,null,null,null,null,null,null,null,null,null,null,null,null,null,null,null,null,null,null,null,null,null,null,null,null,null,null,null,null,null,null,{"$f":"学校一覧!A247","v":241},{"$f":"学校一覧!B247","v":192},{"$f":"学校一覧!C247","v":193},{"$f":"学校一覧!D247","v":0},{"$f":"学校一覧!E247","v":"三原市立本郷中学校"},{"$f":"学校一覧!F247","v":"34D23"},null,null,null,null,null,0]
[242,null,null,null,null,null,null,null,null,null,null,null,null,null,null,null,null,null,null,null,null,null,null,null,null,null,null,null,null,null,null,{"$f":"学校一覧!A248","v":242},{"$f":"学校一覧!B248","v":193},{"$f":"学校一覧!C248","v":194},{"$f":"学校一覧!D248","v":0},{"$f":"学校一覧!E248","v":"三原市立久井中学校"},{"$f":"学校一覧!F248","v":"34D24"},null,null,null,null,null,0]
[243,null,null,null,null,null,null,null,null,null,null,null,null,null,null,null,null,null,null,null,null,null,null,null,null,null,null,null,null,null,null,{"$f":"学校一覧!A249","v":243},{"$f":"学校一覧!B249","v":194},{"$f":"学校一覧!C249","v":195},{"$f":"学校一覧!D249","v":0},{"$f":"学校一覧!E249","v":"三原市立大和中学校"},{"$f":"学校一覧!F249","v":"34D25"},null,null,null,null,null,0]
[244,null,null,null,null,null,null,null,null,null,null,null,null,null,null,null,null,null,null,null,null,null,null,null,null,null,null,null,null,null,null,{"$f":"学校一覧!A250","v":244},{"$f":"学校一覧!B250","v":195},{"$f":"学校一覧!C250","v":196},{"$f":"学校一覧!D250","v":0},{"$f":"学校一覧!E250","v":"広島大学附属三原中学校"},{"$f":"学校一覧!F250","v":"34D26"},null,null,null,null,null,0]
[245,null,null,null,null,null,null,null,null,null,null,null,null,null,null,null,null,null,null,null,null,null,null,null,null,null,null,null,null,null,null,{"$f":"学校一覧!A251","v":245},{"$f":"学校一覧!B251","v":196},{"$f":"学校一覧!C251","v":197},{"$f":"学校一覧!D251","v":0},{"$f":"学校一覧!E251","v":"如水館中学校"},{"$f":"学校一覧!F251","v":"34D27"},null,null,null,null,null,0]
[246,null,null,null,null,null,null,null,null,null,null,null,null,null,null,null,null,null,null,null,null,null,null,null,null,null,null,null,null,null,null,{"$f":"学校一覧!A252","v":246},{"$f":"学校一覧!B252","v":0},{"$f":"学校一覧!C252","v":0},{"$f":"学校一覧!D252","v":0},{"$f":"学校一覧!E252","v":"予備"},{"$f":"学校一覧!F252","v":0},null,null,null,null,null,0]
[247,null,null,null,null,null,null,null,null,null,null,null,null,null,null,null,null,null,null,null,null,null,null,null,null,null,null,null,null,null,null,{"$f":"学校一覧!A253","v":247},{"$f":"学校一覧!B253","v":0},{"$f":"学校一覧!C253","v":0},{"$f":"学校一覧!D253","v":0},{"$f":"学校一覧!E253","v":"予備"},{"$f":"学校一覧!F253","v":0},null,null,null,null,null,0]
[248,null,null,null,null,null,null,null,null,null,null,null,null,null,null,null,null,null,null,null,null,null,null,null,null,null,null,null,null,null,null,{"$f":"学校一覧!A254","v":248},{"$f":"学校一覧!B254","v":0},{"$f":"学校一覧!C254","v":0},{"$f":"学校一覧!D254","v":0},{"$f":"学校一覧!E254","v":"予備"},{"$f":"学校一覧!F254","v":0},null,null,null,null,null,0]
[249,null,null,null,null,null,null,null,null,null,null,null,null,null,null,null,null,null,null,null,null,null,null,null,null,null,null,null,null,null,null,{"$f":"学校一覧!A255","v":249},{"$f":"学校一覧!B255","v":197},{"$f":"学校一覧!C255","v":198},{"$f":"学校一覧!D255","v":"南部地区　豊田・竹原"},{"$f":"学校一覧!E255","v":"大崎上島町立大崎中学校"},{"$f":"学校一覧!F255","v":"34D33"},null,null,null,null,null,0]
[250,null,null,null,null,null,null,null,null,null,null,null,null,null,null,null,null,null,null,null,null,null,null,null,null,null,null,null,null,null,null,{"$f":"学校一覧!A256","v":250},{"$f":"学校一覧!B256","v":198},{"$f":"学校一覧!C256","v":199},{"$f":"学校一覧!D256","v":0},{"$f":"学校一覧!E256","v":"竹原市立忠海中学校"},{"$f":"学校一覧!F256","v":"34D38"},null,null,null,null,null,0]
[251,null,null,null,null,null,null,null,null,null,null,null,null,null,null,null,null,null,null,null,null,null,null,null,null,null,null,null,null,null,null,{"$f":"学校一覧!A257","v":251},{"$f":"学校一覧!B257","v":199},{"$f":"学校一覧!C257","v":200},{"$f":"学校一覧!D257","v":0},{"$f":"学校一覧!E257","v":"竹原市立竹原中学校"},{"$f":"学校一覧!F257","v":"34D39"},null,null,null,null,null,0]
[252,null,null,null,null,null,null,null,null,null,null,null,null,null,null,null,null,null,null,null,null,null,null,null,null,null,null,null,null,null,null,{"$f":"学校一覧!A258","v":252},{"$f":"学校一覧!B258","v":200},{"$f":"学校一覧!C258","v":201},{"$f":"学校一覧!D258","v":0},{"$f":"学校一覧!E258","v":"竹原市立賀茂川中学校"},{"$f":"学校一覧!F258","v":"34D40"},null,null,null,null,null,0]
[253,null,null,null,null,null,null,null,null,null,null,null,null,null,null,null,null,null,null,null,null,null,null,null,null,null,null,null,null,null,null,{"$f":"学校一覧!A259","v":253},{"$f":"学校一覧!B259","v":201},{"$f":"学校一覧!C259","v":202},{"$f":"学校一覧!D259","v":0},{"$f":"学校一覧!E259","v":"竹原市立吉名中学校"},{"$f":"学校一覧!F259","v":"34D41"},null,null,null,null,null,0]
[254,null,null,null,null,null,null,null,null,null,null,null,null,null,null,null,null,null,null,null,null,null,null,null,null,null,null,null,null,null,null,{"$f":"学校一覧!A260","v":254},{"$f":"学校一覧!B260","v":0},{"$f":"学校一覧!C260","v":0},{"$f":"学校一覧!D260","v":0},{"$f":"学校一覧!E260","v":"予備"},{"$f":"学校一覧!F260","v":0},null,null,null,null,null,0]
[255,null,null,null,null,null,null,null,null,null,null,null,null,null,null,null,null,null,null,null,null,null,null,null,null,null,null,null,null,null,null,{"$f":"学校一覧!A261","v":255},{"$f":"学校一覧!B261","v":0},{"$f":"学校一覧!C261","v":0},{"$f":"学校一覧!D261","v":0},{"$f":"学校一覧!E261","v":"予備"},{"$f":"学校一覧!F261","v":0},null,null,null,null,null,0]
[256,null,null,null,null,null,null,null,null,null,null,null,null,null,null,null,null,null,null,null,null,null,null,null,null,null,null,null,null,null,null,{"$f":"学校一覧!A262","v":256},{"$f":"学校一覧!B262","v":0},{"$f":"学校一覧!C262","v":0},{"$f":"学校一覧!D262","v":0},{"$f":"学校一覧!E262","v":"予備"},{"$f":"学校一覧!F262","v":0},null,null,null,null,null,0]
[257,null,null,null,null,null,null,null,null,null,null,null,null,null,null,null,null,null,null,null,null,null,null,null,null,null,null,null,null,null,null,{"$f":"学校一覧!A263","v":257},{"$f":"学校一覧!B263","v":202},{"$f":"学校一覧!C263","v":203},{"$f":"学校一覧!D263","v":"南部地区　　世羅郡"},{"$f":"学校一覧!E263","v":"世羅町立甲山中学校"},{"$f":"学校一覧!F263","v":"34D42"},null,null,null,null,null,0]
[258,null,null,null,null,null,null,null,null,null,null,null,null,null,null,null,null,null,null,null,null,null,null,null,null,null,null,null,null,null,null,{"$f":"学校一覧!A264","v":258},{"$f":"学校一覧!B264","v":203},{"$f":"学校一覧!C264","v":204},{"$f":"学校一覧!D264","v":0},{"$f":"学校一覧!E264","v":"世羅町立世羅中学校"},{"$f":"学校一覧!F264","v":"34D43"},null,null,null,null,null,{"$f":"SUM(AO263:AP263)","v":0}]
[259,null,null,null,null,null,null,null,null,null,null,null,null,null,null,null,null,null,null,null,null,null,null,null,null,null,null,null,null,null,null,{"$f":"学校一覧!A265","v":259},{"$f":"学校一覧!B265","v":204},{"$f":"学校一覧!C265","v":205},{"$f":"学校一覧!D265","v":0},{"$f":"学校一覧!E265","v":"世羅町立世羅西中学校"},{"$f":"学校一覧!F265","v":"34D44"},null,null,null,null,null,0]
[260,null,null,null,null,null,null,null,null,null,null,null,null,null,null,null,null,null,null,null,null,null,null,null,null,null,null,null,null,null,null,{"$f":"学校一覧!A266","v":260},{"$f":"学校一覧!B266","v":206},{"$f":"学校一覧!C266","v":206},{"$f":"学校一覧!D266","v":0},{"$f":"学校一覧!E266","v":"福山市立城北中学校"},{"$f":"学校一覧!F266","v":"34F02"},null,null,null,null,null,0]
[261,null,null,null,null,null,null,null,null,null,null,null,null,null,null,null,null,null,null,null,null,null,null,null,null,null,null,null,null,null,null,{"$f":"学校一覧!A267","v":261},{"$f":"学校一覧!B267","v":208},{"$f":"学校一覧!C267","v":207},{"$f":"学校一覧!D267","v":0},{"$f":"学校一覧!E267","v":"福山市立鷹取中学校"},{"$f":"学校一覧!F267","v":"34F04"},null,null,null,null,null,0]
[262,null,null,null,null,null,null,null,null,null,null,null,null,null,null,null,null,null,null,null,null,null,null,null,null,null,null,null,null,null,null,{"$f":"学校一覧!A268","v":262},{"$f":"学校一覧!B268","v":210},{"$f":"学校一覧!C268","v":208},{"$f":"学校一覧!D268","v":0},{"$f":"学校一覧!E268","v":"福山市立幸千中学校"},{"$f":"学校一覧!F268","v":"34F06"},null,null,null,null,null,0]
[263,null,null,null,null,null,null,null,null,null,null,null,null,null,null,null,null,null,null,null,null,null,null,null,null,null,null,null,null,null,null,{"$f":"学校一覧!A269","v":263},{"$f":"学校一覧!B269","v":211},{"$f":"学校一覧!C269","v":209},{"$f":"学校一覧!D269","v":0},{"$f":"学校一覧!E269","v":"福山市立済美中学校"},{"$f":"学校一覧!F269","v":"34F07"},null,null,null,null,null,0]
[264,null,null,null,null,null,null,null,null,null,null,null,null,null,null,null,null,null,null,null,null,null,null,null,null,null,null,null,null,null,null,{"$f":"学校一覧!A270","v":264},{"$f":"学校一覧!B270","v":212},{"$f":"学校一覧!C270","v":210},{"$f":"学校一覧!D270","v":0},{"$f":"学校一覧!E270","v":"福山市立向丘中学校"},{"$f":"学校一覧!F270","v":"34F08"},null,null,null,null,null,0]
[265,null,null,null,null,null,null,null,null,null,null,null,null,null,null,null,null,null,null,null,null,null,null,null,null,null,null,null,null,null,null,{"$f":"学校一覧!A271","v":265},{"$f":"学校一覧!B271","v":213},{"$f":"学校一覧!C271","v":211},{"$f":"学校一覧!D271","v":0},{"$f":"学校一覧!E271","v":"福山市立鞆中学校"},{"$f":"学校一覧!F271","v":"34F09"},null,null,null,null,null,0]
[266,null,null,null,null,null,null,null,null,null,null,null,null,null,null,null,null,null,null,null,null,null,null,null,null,null,null,null,null,null,null,{"$f":"学校一覧!A272","v":266},{"$f":"学校一覧!B272","v":214},{"$f":"学校一覧!C272","v":212},{"$f":"学校一覧!D272","v":0},{"$f":"学校一覧!E272","v":"福山市立走島中学校"},{"$f":"学校一覧!F272","v":"34F10"},null,null,null,null,null,0]
[267,null,null,null,null,null,null,null,null,null,null,null,null,null,null,null,null,null,null,null,null,null,null,null,null,null,null,null,null,null,null,{"$f":"学校一覧!A273","v":267},{"$f":"学校一覧!B273","v":217},{"$f":"学校一覧!C273","v":213},{"$f":"学校一覧!D273","v":0},{"$f":"学校一覧!E273","v":"福山市立大成館中学校"},{"$f":"学校一覧!F273","v":"34F13"},null,null,null,null,null,0]
[268,null,null,null,null,null,null,null,null,null,null,null,null,null,null,null,null,null,null,null,null,null,null,null,null,null,null,null,null,null,null,{"$f":"学校一覧!A274","v":268},{"$f":"学校一覧!B274","v":218},{"$f":"学校一覧!C274","v":214},{"$f":"学校一覧!D274","v":0},{"$f":"学校一覧!E274","v":"福山市立松永中学校"},{"$f":"学校一覧!F274","v":"34F14"},null,null,null,null,null,0]
[269,null,null,null,null,null,null,null,null,null,null,null,null,null,null,null,null,null,null,null,null,null,null,null,null,null,null,null,null,null,null,{"$f":"学校一覧!A275","v":269},{"$f":"学校一覧!B275","v":219},{"$f":"学校一覧!C275","v":215},{"$f":"学校一覧!D275","v":0},{"$f":"学校一覧!E275","v":"福山市立精華中学校"},{"$f":"学校一覧!F275","v":"34F15"},null,null,null,null,null,0]
[270,null,null,null,null,null,null,null,null,null,null,null,null,null,null,null,null,null,null,null,null,null,null,null,null,null,null,null,null,null,null,{"$f":"学校一覧!A276","v":270},{"$f":"学校一覧!B276","v":221},{"$f":"学校一覧!C276","v":216},{"$f":"学校一覧!D276","v":0},{"$f":"学校一覧!E276","v":"福山市立芦田中学校"},{"$f":"学校一覧!F276","v":"34F17"},null,null,null,null,null,0]
[271,null,null,null,null,null,null,null,null,null,null,null,null,null,null,null,null,null,null,null,null,null,null,null,null,null,null,null,null,null,null,{"$f":"学校一覧!A277","v":271},{"$f":"学校一覧!B277","v":222},{"$f":"学校一覧!C277","v":217},{"$f":"学校一覧!D277","v":0},{"$f":"学校一覧!E277","v":"福山市立山野中学校"},{"$f":"学校一覧!F277","v":"34F18"},null,null,null,null,null,0]
[272,null,null,null,null,null,null,null,null,null,null,null,null,null,null,null,null,null,null,null,null,null,null,null,null,null,null,null,null,null,null,{"$f":"学校一覧!A278","v":272},{"$f":"学校一覧!B278","v":223},{"$f":"学校一覧!C278","v":218},{"$f":"学校一覧!D278","v":0},{"$f":"学校一覧!E278","v":"福山市立広瀬中学校"},{"$f":"学校一覧!F278","v":"34F19"},null,null,null,null,null,0]
[273,null,null,null,null,null,null,null,null,null,null,null,null,null,null,null,null,null,null,null,null,null,null,null,null,null,null,null,null,null,null,{"$f":"学校一覧!A279","v":273},{"$f":"学校一覧!B279","v":224},{"$f":"学校一覧!C279","v":219},{"$f":"学校一覧!D279","v":0},{"$f":"学校一覧!E279","v":"福山市立加茂中学校"},{"$f":"学校一覧!F279","v":"34F20"},null,null,null,null,null,0]
[274,null,null,null,null,null,null,null,null,null,null,null,null,null,null,null,null,null,null,null,null,null,null,null,null,null,null,null,null,null,null,{"$f":"学校一覧!A280","v":274},{"$f":"学校一覧!B280","v":225},{"$f":"学校一覧!C280","v":220},{"$f":"学校一覧!D280","v":0},{"$f":"学校一覧!E280","v":"福山市立駅家中学校"},{"$f":"学校一覧!F280","v":"34F21"},null,null,null,null,null,0]
[275,null,null,null,null,null,null,null,null,null,null,null,null,null,null,null,null,null,null,null,null,null,null,null,null,null,null,null,null,null,null,{"$f":"学校一覧!A281","v":275},{"$f":"学校一覧!B281","v":227},{"$f":"学校一覧!C281","v":221},{"$f":"学校一覧!D281","v":0},{"$f":"学校一覧!E281","v":"福山市立城西中学校"},{"$f":"学校一覧!F281","v":"34F23"},null,null,null,null,null,0]
[276,null,null,null,null,null,null,null,null,null,null,null,null,null,null,null,null,null,null,null,null,null,null,null,null,null,null,null,null,null,null,{"$f":"学校一覧!A282","v":276},{"$f":"学校一覧!B282","v":231},{"$f":"学校一覧!C282","v":222},{"$f":"学校一覧!D282","v":0},{"$f":"学校一覧!E282","v":"福山市立駅家南中学校"},{"$f":"学校一覧!F282","v":"34F27"},null,null,null,null,null,0]
[277,null,null,null,null,null,null,null,null,null,null,null,null,null,null,null,null,null,null,null,null,null,null,null,null,null,null,null,null,null,null,{"$f":"学校一覧!A283","v":277},{"$f":"学校一覧!B283","v":232},{"$f":"学校一覧!C283","v":223},{"$f":"学校一覧!D283","v":0},{"$f":"学校一覧!E283","v":"福山市立内海中学校"},{"$f":"学校一覧!F283","v":"34F28"},null,null,null,null,null,0]
[278,null,null,null,null,null,null,null,null,null,null,null,null,null,null,null,null,null,null,null,null,null,null,null,null,null,null,null,null,null,null,{"$f":"学校一覧!A284","v":278},{"$f":"学校一覧!B284","v":233},{"$f":"学校一覧!C284","v":224},{"$f":"学校一覧!D284","v":0},{"$f":"学校一覧!E284","v":"福山市立常金中学校"},{"$f":"学校一覧!F284","v":"34F29"},null,null,null,null,null,0]
[279,null,null,null,null,null,null,null,null,null,null,null,null,null,null,null,null,null,null,null,null,null,null,null,null,null,null,null,null,null,null,{"$f":"学校一覧!A285","v":279},{"$f":"学校一覧!B285","v":234},{"$f":"学校一覧!C285","v":225},{"$f":"学校一覧!D285","v":0},{"$f":"学校一覧!E285","v":"福山市立新市中央中学校"},{"$f":"学校一覧!F285","v":"34F30"},null,null,null,null,null,0]
[280,null,null,null,null,null,null,null,null,null,null,null,null,null,null,null,null,null,null,null,null,null,null,null,null,null,null,null,null,null,null,{"$f":"学校一覧!A286","v":280},{"$f":"学校一覧!B286","v":235},{"$f":"学校一覧!C286","v":226},{"$f":"学校一覧!D286","v":0},{"$f":"学校一覧!E286","v":"福山市立福山中学校"},{"$f":"学校一覧!F286","v":"34F31"},null,null,null,null,null,0]
[281,null,null,null,null,null,null,null,null,null,null,null,null,null,null,null,null,null,null,null,null,null,null,null,null,null,null,null,null,null,null,{"$f":"学校一覧!A287","v":281},{"$f":"学校一覧!B287","v":236},{"$f":"学校一覧!C287","v":227},{"$f":"学校一覧!D287","v":0},{"$f":"学校一覧!E287","v":"福山市立千年中学校"},{"$f":"学校一覧!F287","v":"34F32"},null,null,null,null,null,0]
[282,null,null,null,null,null,null,null,null,null,null,null,null,null,null,null,null,null,null,null,null,null,null,null,null,null,null,null,null,null,null,{"$f":"学校一覧!A288","v":282},{"$f":"学校一覧!B288","v":237},{"$f":"学校一覧!C288","v":228},{"$f":"学校一覧!D288","v":0},{"$f":"学校一覧!E288","v":"福山市立至誠中学校"},{"$f":"学校一覧!F288","v":"34F33"},null,null,null,null,null,0]
[283,null,null,null,null,null,null,null,null,null,null,null,null,null,null,null,null,null,null,null,null,null,null,null,null,null,null,null,null,null,null,{"$f":"学校一覧!A289","v":283},{"$f":"学校一覧!B289","v":242},{"$f":"学校一覧!C289","v":229},{"$f":"学校一覧!D289","v":0},{"$f":"学校一覧!E289","v":"近畿大学附属福山中学校"},{"$f":"学校一覧!F289","v":"34F35"},null,null,null,null,null,0]
[284,null,null,null,null,null,null,null,null,null,null,null,null,null,null,null,null,null,null,null,null,null,null,null,null,null,null,null,null,null,null,{"$f":"学校一覧!A290","v":284},{"$f":"学校一覧!B290","v":0},{"$f":"学校一覧!C290","v":0},{"$f":"学校一覧!D290","v":0},{"$f":"学校一覧!E290","v":"予備"},{"$f":"学校一覧!F290","v":0},null,null,null,null,null,0]
[285,null,null,null,null,null,null,null,null,null,null,null,null,null,null,null,null,null,null,null,null,null,null,null,null,null,null,null,null,null,null,{"$f":"学校一覧!A291","v":285},{"$f":"学校一覧!B291","v":0},{"$f":"学校一覧!C291","v":0},{"$f":"学校一覧!D291","v":0},{"$f":"学校一覧!E291","v":"予備"},{"$f":"学校一覧!F291","v":0},null,null,null,null,null,0]
[286,null,null,null,null,null,null,null,null,null,null,null,null,null,null,null,null,null,null,null,null,null,null,null,null,null,null,null,null,null,null,{"$f":"学校一覧!A292","v":286},{"$f":"学校一覧!B292","v":0},{"$f":"学校一覧!C292","v":0},{"$f":"学校一覧!D292","v":0},{"$f":"学校一覧!E292","v":"予備"},{"$f":"学校一覧!F292","v":0},null,null,null,null,null,0]
[287,null,null,null,null,null,null,null,null,null,null,null,null,null,null,null,null,null,null,null,null,null,null,null,null,null,null,null,null,null,null,{"$f":"学校一覧!A293","v":287},{"$f":"学校一覧!B293","v":205},{"$f":"学校一覧!C293","v":230},{"$f":"学校一覧!D293","v":"福山地区　福山市"},{"$f":"学校一覧!E293","v":"福山市立東中学校"},{"$f":"学校一覧!F293","v":"34F01"},null,null,null,null,null,0]
[288,null,null,null,null,null,null,null,null,null,null,null,null,null,null,null,null,null,null,null,null,null,null,null,null,null,null,null,null,null,null,{"$f":"学校一覧!A294","v":288},{"$f":"学校一覧!B294","v":207},{"$f":"学校一覧!C294","v":231},{"$f":"学校一覧!D294","v":0},{"$f":"学校一覧!E294","v":"福山市立城南中学校"},{"$f":"学校一覧!F294","v":"34F03"},null,null,null,null,null,0]
[289,null,null,null,null,null,null,null,null,null,null,null,null,null,null,null,null,null,null,null,null,null,null,null,null,null,null,null,null,null,null,{"$f":"学校一覧!A295","v":289},{"$f":"学校一覧!B295","v":209},{"$f":"学校一覧!C295","v":232},{"$f":"学校一覧!D295","v":0},{"$f":"学校一覧!E295","v":"福山市立城東中学校"},{"$f":"学校一覧!F295","v":"34F05"},null,null,null,null,null,0]
[290,null,null,null,null,null,null,null,null,null,null,null,null,null,null,null,null,null,null,null,null,null,null,null,null,null,null,null,null,null,null,{"$f":"学校一覧!A296","v":290},{"$f":"学校一覧!B296","v":215},{"$f":"学校一覧!C296","v":233},{"$f":"学校一覧!D296","v":0},{"$f":"学校一覧!E296","v":"福山市立鳳中学校"},{"$f":"学校一覧!F296","v":"34F11"},null,null,null,null,null,0]
[291,null,null,null,null,null,null,null,null,null,null,null,null,null,null,null,null,null,null,null,null,null,null,null,null,null,null,null,null,null,null,{"$f":"学校一覧!A297","v":291},{"$f":"学校一覧!B297","v":216},{"$f":"学校一覧!C297","v":234},{"$f":"学校一覧!D297","v":0},{"$f":"学校一覧!E297","v":"福山市立培遠中学校"},{"$f":"学校一覧!F297","v":"34F12"},null,null,null,null,null,0]
[292,null,null,null,null,null,null,null,null,null,null,null,null,null,null,null,null,null,null,null,null,null,null,null,null,null,null,null,null,null,null,{"$f":"学校一覧!A298","v":292},{"$f":"学校一覧!B298","v":220},{"$f":"学校一覧!C298","v":235},{"$f":"学校一覧!D298","v":0},{"$f":"学校一覧!E298","v":"福山市立中央中学校"},{"$f":"学校一覧!F298","v":"34F16"},null,null,null,null,null,0]
[293,null,null,null,null,null,null,null,null,null,null,null,null,null,null,null,null,null,null,null,null,null,null,null,null,null,null,null,null,null,null,{"$f":"学校一覧!A299","v":293},{"$f":"学校一覧!B299","v":226},{"$f":"学校一覧!C299","v":236},{"$f":"学校一覧!D299","v":0},{"$f":"学校一覧!E299","v":"福山市立誠之中学校"},{"$f":"学校一覧!F299","v":"34F22"},null,null,null,null,null,0]
[294,null,null,null,null,null,null,null,null,null,null,null,null,null,null,null,null,null,null,null,null,null,null,null,null,null,null,null,null,null,null,{"$f":"学校一覧!A300","v":294},{"$f":"学校一覧!B300","v":228},{"$f":"学校一覧!C300","v":237},{"$f":"学校一覧!D300","v":0},{"$f":"学校一覧!E300","v":"福山市立大門中学校"},{"$f":"学校一覧!F300","v":"34F24"},null,null,null,null,null,0]
[295,null,null,null,null,null,null,null,null,null,null,null,null,null,null,null,null,null,null,null,null,null,null,null,null,null,null,null,null,null,null,{"$f":"学校一覧!A301","v":295},{"$f":"学校一覧!B301","v":229},{"$f":"学校一覧!C301","v":238},{"$f":"学校一覧!D301","v":0},{"$f":"学校一覧!E301","v":"福山市立一ツ橋中学校"},{"$f":"学校一覧!F301","v":"34F25"},null,null,null,null,null,0]
[296,null,null,null,null,null,null,null,null,null,null,null,null,null,null,null,null,null,null,null,null,null,null,null,null,null,null,null,null,null,null,{"$f":"学校一覧!A302","v":296},{"$f":"学校一覧!B302","v":230},{"$f":"学校一覧!C302","v":239},{"$f":"学校一覧!D302","v":0},{"$f":"学校一覧!E302","v":"福山市立東朋中学校"},{"$f":"学校一覧!F302","v":"34F26"},null,null,null,null,null,0]
[297,null,null,null,null,null,null,null,null,null,null,null,null,null,null,null,null,null,null,null,null,null,null,null,null,null,null,null,null,null,null,{"$f":"学校一覧!A303","v":297},{"$f":"学校一覧!B303","v":238},{"$f":"学校一覧!C303","v":240},{"$f":"学校一覧!D303","v":0},{"$f":"学校一覧!E303","v":"福山市立神辺中学校"},{"$f":"学校一覧!F303","v":"34F40"},null,null,null,null,null,0]
[298,null,null,null,null,null,null,null,null,null,null,null,null,null,null,null,null,null,null,null,null,null,null,null,null,null,null,null,null,null,null,{"$f":"学校一覧!A304","v":298},{"$f":"学校一覧!B304","v":239},{"$f":"学校一覧!C304","v":241},{"$f":"学校一覧!D304","v":0},{"$f":"学校一覧!E304","v":"福山市立神辺東中学校"},{"$f":"学校一覧!F304","v":"34F41"},null,null,null,null,null,0]
[299,null,null,null,null,null,null,null,null,null,null,null,null,null,null,null,null,null,null,null,null,null,null,null,null,null,null,null,null,null,null,{"$f":"学校一覧!A305","v":299},{"$f":"学校一覧!B305","v":240},{"$f":"学校一覧!C305","v":242},{"$f":"学校一覧!D305","v":0},{"$f":"学校一覧!E305","v":"福山市立神辺西中学校"},{"$f":"学校一覧!F305","v":"34F42"},null,null,null,null,null,0]
[300,null,null,null,null,null,null,null,null,null,null,null,null,null,null,null,null,null,null,null,null,null,null,null,null,null,null,null,null,null,null,{"$f":"学校一覧!A306","v":300},{"$f":"学校一覧!B306","v":241},{"$f":"学校一覧!C306","v":243},{"$f":"学校一覧!D306","v":0},{"$f":"学校一覧!E306","v":"広島大学附属福山中学校"},{"$f":"学校一覧!F306","v":"34F34"},null,null,null,null,null,0]
[301,null,null,null,null,null,null,null,null,null,null,null,null,null,null,null,null,null,null,null,null,null,null,null,null,null,null,null,null,null,null,{"$f":"学校一覧!A307","v":301},{"$f":"学校一覧!B307","v":243},{"$f":"学校一覧!C307","v":244},{"$f":"学校一覧!D307","v":0},{"$f":"学校一覧!E307","v":"福山暁の星女子中学校"},{"$f":"学校一覧!F307","v":"34F36"},null,null,null,null,null,0]
[302,null,null,null,null,null,null,null,null,null,null,null,null,null,null,null,null,null,null,null,null,null,null,null,null,null,null,null,null,null,null,{"$f":"学校一覧!A308","v":302},{"$f":"学校一覧!B308","v":244},{"$f":"学校一覧!C308","v":245},{"$f":"学校一覧!D308","v":0},{"$f":"学校一覧!E308","v":"盈進中学校"},{"$f":"学校一覧!F308","v":"34F37"},null,null,null,null,null,0]
[303,null,null,null,null,null,null,null,null,null,null,null,null,null,null,null,null,null,null,null,null,null,null,null,null,null,null,null,null,null,null,{"$f":"学校一覧!A309","v":303},{"$f":"学校一覧!B309","v":245},{"$f":"学校一覧!C309","v":246},{"$f":"学校一覧!D309","v":0},{"$f":"学校一覧!E309","v":"銀河学院中学校"},{"$f":"学校一覧!F309","v":"34F38"},null,null,null,null,null,0]
[304,null,null,null,null,null,null,null,null,null,null,null,null,null,null,null,null,null,null,null,null,null,null,null,null,null,null,null,null,null,null,{"$f":"学校一覧!A310","v":304},{"$f":"学校一覧!B310","v":246},{"$f":"学校一覧!C310","v":247},{"$f":"学校一覧!D310","v":0},{"$f":"学校一覧!E310","v":"英数学館中学校"},{"$f":"学校一覧!F310","v":"34F39"},null,null,null,null,null,0]
[305,null,null,null,null,null,null,null,null,null,null,null,null,null,null,null,null,null,null,null,null,null,null,null,null,null,null,null,null,null,null,{"$f":"学校一覧!A311","v":305},{"$f":"学校一覧!B311","v":0},{"$f":"学校一覧!C311","v":0},{"$f":"学校一覧!D311","v":0},{"$f":"学校一覧!E311","v":"予備"},{"$f":"学校一覧!F311","v":0},null,null,null,null,null,0]
[306,null,null,null,null,null,null,null,null,null,null,null,null,null,null,null,null,null,null,null,null,null,null,null,null,null,null,null,null,null,null,{"$f":"学校一覧!A312","v":306},{"$f":"学校一覧!B312","v":0},{"$f":"学校一覧!C312","v":0},{"$f":"学校一覧!D312","v":0},{"$f":"学校一覧!E312","v":"予備"},{"$f":"学校一覧!F312","v":0},null,null,null,null,null,0]
[307,null,null,null,null,null,null,null,null,null,null,null,null,null,null,null,null,null,null,null,null,null,null,null,null,null,null,null,null,null,null,{"$f":"学校一覧!A313","v":307},{"$f":"学校一覧!B313","v":0},{"$f":"学校一覧!C313","v":0},{"$f":"学校一覧!D313","v":0},{"$f":"学校一覧!E313","v":"予備"},{"$f":"学校一覧!F313","v":0},null,null,null,null,null,0]
[308,null,null,null,null,null,null,null,null,null,null,null,null,null,null,null,null,null,null,null,null,null,null,null,null,null,null,null,null,null,null,{"$f":"学校一覧!A314","v":308},{"$f":"学校一覧!B314","v":247},{"$f":"学校一覧!C314","v":248},{"$f":"学校一覧!D314","v":"福山地区　府中市"},{"$f":"学校一覧!E314","v":"府中市立第一中学校"},{"$f":"学校一覧!F314","v":"34F43"},null,null,null,null,null,0]
[309,null,null,null,null,null,null,null,null,null,null,null,null,null,null,null,null,null,null,null,null,null,null,null,null,null,null,null,null,null,null,{"$f":"学校一覧!A315","v":309},{"$f":"学校一覧!B315","v":248},{"$f":"学校一覧!C315","v":249},{"$f":"学校一覧!D315","v":0},{"$f":"学校一覧!E315","v":"府中市立府中中学校"},{"$f":"学校一覧!F315","v":"34F44"},null,null,null,null,null,0]
[310,null,null,null,null,null,null,null,null,null,null,null,null,null,null,null,null,null,null,null,null,null,null,null,null,null,null,null,null,null,null,{"$f":"学校一覧!A316","v":310},{"$f":"学校一覧!B316","v":249},{"$f":"学校一覧!C316","v":250},{"$f":"学校一覧!D316","v":0},{"$f":"学校一覧!E316","v":"府中市立府中明郷中学校"},{"$f":"学校一覧!F316","v":"34F45"},null,null,null,null,null,0]
[311,null,null,null,null,null,null,null,null,null,null,null,null,null,null,null,null,null,null,null,null,null,null,null,null,null,null,null,null,null,null,{"$f":"学校一覧!A317","v":311},{"$f":"学校一覧!B317","v":250},{"$f":"学校一覧!C317","v":251},{"$f":"学校一覧!D317","v":0},{"$f":"学校一覧!E317","v":"府中市立上下中学校"},{"$f":"学校一覧!F317","v":"34F47"},null,null,null,null,null,0]
[312,null,null,null,null,null,null,null,null,null,null,null,null,null,null,null,null,null,null,null,null,null,null,null,null,null,null,null,null,null,null,{"$f":"学校一覧!A318","v":312},{"$f":"学校一覧!B318","v":0},{"$f":"学校一覧!C318","v":0},{"$f":"学校一覧!D318","v":0},{"$f":"学校一覧!E318","v":"予備"},{"$f":"学校一覧!F321","v":"34F48"},null,null,null,null,null,0]
[313,null,null,null,null,null,null,null,null,null,null,null,null,null,null,null,null,null,null,null,null,null,null,null,null,null,null,null,null,null,null,{"$f":"学校一覧!A319","v":313},{"$f":"学校一覧!B319","v":0},{"$f":"学校一覧!C319","v":0},{"$f":"学校一覧!D319","v":0},{"$f":"学校一覧!E319","v":"予備"},{"$f":"学校一覧!F322","v":"34F49"},null,null,null,null,null,0]
[314,null,null,null,null,null,null,null,null,null,null,null,null,null,null,null,null,null,null,null,null,null,null,null,null,null,null,null,null,null,null,{"$f":"学校一覧!A320","v":314},{"$f":"学校一覧!B320","v":0},{"$f":"学校一覧!C320","v":0},{"$f":"学校一覧!D320","v":0},{"$f":"学校一覧!E320","v":"予備"},{"$f":"学校一覧!F323","v":"34F50"},null,null,null,null,null,0]
[315,null,null,null,null,null,null,null,null,null,null,null,null,null,null,null,null,null,null,null,null,null,null,null,null,null,null,null,null,null,null,{"$f":"学校一覧!A321","v":315},{"$f":"学校一覧!B321","v":251},{"$f":"学校一覧!C321","v":252},{"$f":"学校一覧!D321","v":"福山地区　神石郡"},{"$f":"学校一覧!E321","v":"神石高原町立三和中学校"},{"$f":"学校一覧!F324","v":"34F51"},null,null,null,null,null,0]
[316,null,null,null,null,null,null,null,null,null,null,null,null,null,null,null,null,null,null,null,null,null,null,null,null,null,null,null,null,null,null,{"$f":"学校一覧!A322","v":316},{"$f":"学校一覧!B322","v":252},{"$f":"学校一覧!C322","v":253},{"$f":"学校一覧!D322","v":0},{"$f":"学校一覧!E322","v":"神石高原町立神石中学校"},{"$f":"学校一覧!#REF!","v":{"$error":"#REF!"}},null,null,null,null,null,0]
[317,null,null,null,null,null,null,null,null,null,null,null,null,null,null,null,null,null,null,null,null,null,null,null,null,null,null,null,null,null,null,{"$f":"学校一覧!A323","v":317},{"$f":"学校一覧!B323","v":253},{"$f":"学校一覧!C323","v":254},{"$f":"学校一覧!D323","v":0},{"$f":"学校一覧!E323","v":"神石高原町立油木中学校"},{"$f":"学校一覧!#REF!","v":{"$error":"#REF!"}},null,null,null,null,null,0]
[318,null,null,null,null,null,null,null,null,null,null,null,null,null,null,null,null,null,null,null,null,null,null,null,null,null,null,null,null,null,null,{"$f":"学校一覧!A324","v":318},{"$f":"学校一覧!B324","v":254},{"$f":"学校一覧!C324","v":255},{"$f":"学校一覧!D324","v":0},{"$f":"学校一覧!E324","v":"神石高原町立豊松中学校"},{"$f":"学校一覧!#REF!","v":{"$error":"#REF!"}},null,null,null,null,null,0]
[319,null,null,null,null,null,null,null,null,null,null,null,null,null,null,null,null,null,null,null,null,null,null,null,null,null,null,null,null,null,null,{"$f":"学校一覧!A325","v":319},{"$f":"学校一覧!B325","v":0},{"$f":"学校一覧!C325","v":0},{"$f":"学校一覧!D325","v":0},{"$f":"学校一覧!E325","v":"予備"},{"$f":"学校一覧!F325","v":0},null,null,null,null,null,0]
[320,null,null,null,null,null,null,null,null,null,null,null,null,null,null,null,null,null,null,null,null,null,null,null,null,null,null,null,null,null,null,{"$f":"学校一覧!A326","v":320},{"$f":"学校一覧!B326","v":0},{"$f":"学校一覧!C326","v":0},{"$f":"学校一覧!D326","v":0},{"$f":"学校一覧!E326","v":"予備"},{"$f":"学校一覧!F326","v":0},null,null,null,null,null,0]
[321,null,null,null,null,null,null,null,null,null,null,null,null,null,null,null,null,null,null,null,null,null,null,null,null,null,null,null,null,null,null,{"$f":"学校一覧!A327","v":321},{"$f":"学校一覧!B327","v":0},{"$f":"学校一覧!C327","v":0},{"$f":"学校一覧!D327","v":0},{"$f":"学校一覧!E327","v":"予備"},{"$f":"学校一覧!F327","v":0},null,null,null,null,null,0]
[322,null,null,null,null,null,null,null,null,null,null,null,null,null,null,null,null,null,null,null,null,null,null,null,null,null,null,null,null,null,null,{"$f":"学校一覧!A328","v":322},{"$f":"学校一覧!B328","v":255},{"$f":"学校一覧!C328","v":256},{"$f":"学校一覧!D328","v":"備北地区　三次市"},{"$f":"学校一覧!E328","v":"三次市立三和中学校"},{"$f":"学校一覧!F328","v":"34G01"},null,null,null,null,null,{"$f":"SUM(AO327:AP327)","v":0}]
[323,null,null,null,null,null,null,null,null,null,null,null,null,null,null,null,null,null,null,null,null,null,null,null,null,null,null,null,null,null,null,{"$f":"学校一覧!A329","v":323},{"$f":"学校一覧!B329","v":256},{"$f":"学校一覧!C329","v":257},{"$f":"学校一覧!D329","v":0},{"$f":"学校一覧!E329","v":"三次市立君田中学校"},{"$f":"学校一覧!F329","v":"34G02"},null,null,null,null,null,0]
[324,null,null,null,null,null,null,null,null,null,null,null,null,null,null,null,null,null,null,null,null,null,null,null,null,null,null,null,null,null,null,{"$f":"学校一覧!A330","v":324},{"$f":"学校一覧!B330","v":257},{"$f":"学校一覧!C330","v":258},{"$f":"学校一覧!D330","v":0},{"$f":"学校一覧!E330","v":"三次市立布野中学校"},{"$f":"学校一覧!F330","v":"34G03"},null,null,null,null,null,0]
[325,null,null,null,null,null,null,null,null,null,null,null,null,null,null,null,null,null,null,null,null,null,null,null,null,null,null,null,null,null,null,{"$f":"学校一覧!A331","v":325},{"$f":"学校一覧!B331","v":258},{"$f":"学校一覧!C331","v":259},{"$f":"学校一覧!D331","v":0},{"$f":"学校一覧!E331","v":"三次市立作木中学校"},{"$f":"学校一覧!F331","v":"34G04"},null,null,null,null,null,0]
[326,null,null,null,null,null,null,null,null,null,null,null,null,null,null,null,null,null,null,null,null,null,null,null,null,null,null,null,null,null,null,{"$f":"学校一覧!A332","v":326},{"$f":"学校一覧!B332","v":259},{"$f":"学校一覧!C332","v":260},{"$f":"学校一覧!D332","v":0},{"$f":"学校一覧!E332","v":"三次市立三良坂中学校"},{"$f":"学校一覧!F332","v":"34G05"},null,null,null,null,null,0]
[327,null,null,null,null,null,null,null,null,null,null,null,null,null,null,null,null,null,null,null,null,null,null,null,null,null,null,null,null,null,null,{"$f":"学校一覧!A333","v":327},{"$f":"学校一覧!B333","v":260},{"$f":"学校一覧!C333","v":261},{"$f":"学校一覧!D333","v":0},{"$f":"学校一覧!E333","v":"三次市立吉舎中学校"},{"$f":"学校一覧!F333","v":"34G06"},null,null,null,null,null,0]
[328,null,null,null,null,null,null,null,null,null,null,null,null,null,null,null,null,null,null,null,null,null,null,null,null,null,null,null,null,null,null,{"$f":"学校一覧!A334","v":328},{"$f":"学校一覧!B334","v":261},{"$f":"学校一覧!C334","v":262},{"$f":"学校一覧!D334","v":0},{"$f":"学校一覧!E334","v":"三次市立三次中学校"},{"$f":"学校一覧!F334","v":"34G07"},null,null,null,null,null,0]
[329,null,null,null,null,null,null,null,null,null,null,null,null,null,null,null,null,null,null,null,null,null,null,null,null,null,null,null,null,null,null,{"$f":"学校一覧!A335","v":329},{"$f":"学校一覧!B335","v":262},{"$f":"学校一覧!C335","v":263},{"$f":"学校一覧!D335","v":0},{"$f":"学校一覧!E335","v":"三次市立十日市中学校"},{"$f":"学校一覧!F335","v":"34G08"},null,null,null,null,null,0]
[330,null,null,null,null,null,null,null,null,null,null,null,null,null,null,null,null,null,null,null,null,null,null,null,null,null,null,null,null,null,null,{"$f":"学校一覧!A336","v":330},{"$f":"学校一覧!B336","v":263},{"$f":"学校一覧!C336","v":264},{"$f":"学校一覧!D336","v":0},{"$f":"学校一覧!E336","v":"三次市立八次中学校"},{"$f":"学校一覧!F336","v":"34G09"},null,null,null,null,null,0]
[331,null,null,null,null,null,null,null,null,null,null,null,null,null,null,null,null,null,null,null,null,null,null,null,null,null,null,null,null,null,null,{"$f":"学校一覧!A337","v":331},{"$f":"学校一覧!B337","v":264},{"$f":"学校一覧!C337","v":265},{"$f":"学校一覧!D337","v":0},{"$f":"学校一覧!E337","v":"三次市立塩町中学校"},{"$f":"学校一覧!F337","v":"34G10"},null,null,null,null,null,0]
[332,null,null,null,null,null,null,null,null,null,null,null,null,null,null,null,null,null,null,null,null,null,null,null,null,null,null,null,null,null,null,{"$f":"学校一覧!A338","v":332},{"$f":"学校一覧!B338","v":265},{"$f":"学校一覧!C338","v":266},{"$f":"学校一覧!D338","v":0},{"$f":"学校一覧!E338","v":"三次市立川地中学校"},{"$f":"学校一覧!F338","v":"34G11"},null,null,null,null,null,0]
[333,null,null,null,null,null,null,null,null,null,null,null,null,null,null,null,null,null,null,null,null,null,null,null,null,null,null,null,null,null,null,{"$f":"学校一覧!A339","v":333},{"$f":"学校一覧!B339","v":266},{"$f":"学校一覧!C339","v":267},{"$f":"学校一覧!D339","v":0},{"$f":"学校一覧!E339","v":"三次市立甲奴中学校"},{"$f":"学校一覧!F339","v":"34G12"},null,null,null,null,null,0]
[334,null,null,null,null,null,null,null,null,null,null,null,null,null,null,null,null,null,null,null,null,null,null,null,null,null,null,null,null,null,null,{"$f":"学校一覧!A340","v":334},{"$f":"学校一覧!B340","v":0},{"$f":"学校一覧!C340","v":0},{"$f":"学校一覧!D340","v":0},{"$f":"学校一覧!E340","v":"予備"},{"$f":"学校一覧!F340","v":0},null,null,null,null,null,0]
[335,null,null,null,null,null,null,null,null,null,null,null,null,null,null,null,null,null,null,null,null,null,null,null,null,null,null,null,null,null,null,{"$f":"学校一覧!A341","v":335},{"$f":"学校一覧!B341","v":0},{"$f":"学校一覧!C341","v":0},{"$f":"学校一覧!D341","v":0},{"$f":"学校一覧!E341","v":"予備"},{"$f":"学校一覧!F341","v":0},null,null,null,null,null,0]
[336,null,null,null,null,null,null,null,null,null,null,null,null,null,null,null,null,null,null,null,null,null,null,null,null,null,null,null,null,null,null,{"$f":"学校一覧!A342","v":336},{"$f":"学校一覧!B342","v":0},{"$f":"学校一覧!C342","v":0},{"$f":"学校一覧!D342","v":0},{"$f":"学校一覧!E342","v":"予備"},{"$f":"学校一覧!F342","v":0},null,null,null,null,null,0]
[337,null,null,null,null,null,null,null,null,null,null,null,null,null,null,null,null,null,null,null,null,null,null,null,null,null,null,null,null,null,null,{"$f":"学校一覧!A343","v":337},{"$f":"学校一覧!B343","v":267},{"$f":"学校一覧!C343","v":268},{"$f":"学校一覧!D343","v":"備北地区　庄原市"},{"$f":"学校一覧!E343","v":"庄原市立庄原中学校"},{"$f":"学校一覧!F343","v":"34G13"},null,null,null,null,null,0]
[338,null,null,null,null,null,null,null,null,null,null,null,null,null,null,null,null,null,null,null,null,null,null,null,null,null,null,null,null,null,null,{"$f":"学校一覧!A344","v":338},{"$f":"学校一覧!B344","v":268},{"$f":"学校一覧!C344","v":269},{"$f":"学校一覧!D344","v":0},{"$f":"学校一覧!E344","v":"庄原市立西城中学校"},{"$f":"学校一覧!F344","v":"34G14"},null,null,null,null,null,0]
[339,null,null,null,null,null,null,null,null,null,null,null,null,null,null,null,null,null,null,null,null,null,null,null,null,null,null,null,null,null,null,{"$f":"学校一覧!A345","v":339},{"$f":"学校一覧!B345","v":269},{"$f":"学校一覧!C345","v":270},{"$f":"学校一覧!D345","v":0},{"$f":"学校一覧!E345","v":"庄原市立東城中学校"},{"$f":"学校一覧!F345","v":"34G16"},null,null,null,null,null,0]
[340,null,null,null,null,null,null,null,null,null,null,null,null,null,null,null,null,null,null,null,null,null,null,null,null,null,null,null,null,null,null,{"$f":"学校一覧!A346","v":340},{"$f":"学校一覧!B346","v":270},{"$f":"学校一覧!C346","v":271},{"$f":"学校一覧!D346","v":0},{"$f":"学校一覧!E346","v":"庄原市立口和中学校"},{"$f":"学校一覧!F346","v":"34G17"},null,null,null,null,null,0]
[341,null,null,null,null,null,null,null,null,null,null,null,null,null,null,null,null,null,null,null,null,null,null,null,null,null,null,null,null,null,null,{"$f":"学校一覧!A347","v":341},{"$f":"学校一覧!B347","v":271},{"$f":"学校一覧!C347","v":272},{"$f":"学校一覧!D347","v":0},{"$f":"学校一覧!E347","v":"庄原市立高野中学校"},{"$f":"学校一覧!F347","v":"34G18"},null,null,null,null,null,0]
[342,null,null,null,null,null,null,null,null,null,null,null,null,null,null,null,null,null,null,null,null,null,null,null,null,null,null,null,null,null,null,{"$f":"学校一覧!A348","v":342},{"$f":"学校一覧!B348","v":272},{"$f":"学校一覧!C348","v":273},{"$f":"学校一覧!D348","v":0},{"$f":"学校一覧!E348","v":"庄原市立比和中学校"},{"$f":"学校一覧!F348","v":"34G19"},null,null,null,null,null,0]
[343,null,null,null,null,null,null,null,null,null,null,null,null,null,null,null,null,null,null,null,null,null,null,null,null,null,null,null,null,null,null,{"$f":"学校一覧!A349","v":343},{"$f":"学校一覧!B349","v":273},{"$f":"学校一覧!C349","v":274},{"$f":"学校一覧!D349","v":0},{"$f":"学校一覧!E349","v":"庄原市立総領中学校"},{"$f":"学校一覧!F349","v":"34G20"},null,null,null,null,null,0]
[344,null,null,null,null,null,null,null,null,null,null,null,null,null,null,null,null,null,null,null,null,null,null,null,null,null,null,null,null,null,null,{"$f":"学校一覧!A350","v":344},{"$f":"学校一覧!B350","v":0},{"$f":"学校一覧!C350","v":0},{"$f":"学校一覧!D350","v":0},{"$f":"学校一覧!E350","v":"予備"},{"$f":"学校一覧!F350","v":0},null,null,null,null,null,0]
[345,null,null,null,null,null,null,null,null,null,null,null,null,null,null,null,null,null,null,null,null,null,null,null,null,null,null,null,null,null,null,{"$f":"学校一覧!A351","v":345},{"$f":"学校一覧!B351","v":0},{"$f":"学校一覧!C351","v":0},{"$f":"学校一覧!D351","v":0},{"$f":"学校一覧!E351","v":"予備"},{"$f":"学校一覧!F351","v":0},null,null,null,null,null,0]
[346,null,null,null,null,null,null,null,null,null,null,null,null,null,null,null,null,null,null,null,null,null,null,null,null,null,null,null,null,null,null,{"$f":"学校一覧!A352","v":346},{"$f":"学校一覧!B352","v":0},{"$f":"学校一覧!C352","v":0},{"$f":"学校一覧!D352","v":0},{"$f":"学校一覧!E352","v":"予備"},{"$f":"学校一覧!F352","v":0},null,null,null,null,null,0]
[347,null,null,null,null,null,null,null,null,null,null,null,null,null,null,null,null,null,null,null,null,null,null,null,null,null,null,null,null,null,null,{"$f":"学校一覧!A353","v":347},{"$f":"学校一覧!B353","v":0},{"$f":"学校一覧!C353","v":0},{"$f":"学校一覧!D353","v":0},{"$f":"学校一覧!E353","v":"予備"},{"$f":"学校一覧!F353","v":0},null,null,null,null,null,0]
[348,null,null,null,null,null,null,null,null,null,null,null,null,null,null,null,null,null,null,null,null,null,null,null,null,null,null,null,null,null,null,{"$f":"学校一覧!A354","v":348},{"$f":"学校一覧!B354","v":0},{"$f":"学校一覧!C354","v":0},{"$f":"学校一覧!D354","v":0},{"$f":"学校一覧!E354","v":"予備"},{"$f":"学校一覧!F354","v":0},null,null,null,null,null,0]
[349,null,null,null,null,null,null,null,null,null,null,null,null,null,null,null,null,null,null,null,null,null,null,null,null,null,null,null,null,null,null,{"$f":"学校一覧!A355","v":349},{"$f":"学校一覧!B355","v":0},{"$f":"学校一覧!C355","v":0},{"$f":"学校一覧!D355","v":0},{"$f":"学校一覧!E355","v":"予備"},{"$f":"学校一覧!F355","v":0},null,null,null,null,null,0]
[350,null,null,null,null,null,null,null,null,null,null,null,null,null,null,null,null,null,null,null,null,null,null,null,null,null,null,null,null,null,null,{"$f":"学校一覧!A356","v":350},{"$f":"学校一覧!B356","v":0},{"$f":"学校一覧!C356","v":0},{"$f":"学校一覧!D356","v":0},{"$f":"学校一覧!E356","v":"予備"},{"$f":"学校一覧!F356","v":0},null,null,null,null,null,0]
[351,null,null,null,null,null,null,null,null,null,null,null,null,null,null,null,null,null,null,null,null,null,null,null,null,null,null,null,null,null,null,{"$f":"学校一覧!A357","v":351},{"$f":"学校一覧!B357","v":0},{"$f":"学校一覧!C357","v":0},{"$f":"学校一覧!D357","v":0},{"$f":"学校一覧!E357","v":"予備"},{"$f":"学校一覧!F357","v":0},null,null,null,null,null,0]
[352,null,null,null,null,null,null,null,null,null,null,null,null,null,null,null,null,null,null,null,null,null,null,null,null,null,null,null,null,null,null,{"$f":"学校一覧!A358","v":352},{"$f":"学校一覧!B358","v":0},{"$f":"学校一覧!C358","v":0},{"$f":"学校一覧!D358","v":0},{"$f":"学校一覧!E358","v":"予備"},{"$f":"学校一覧!F358","v":0},null,null,null,null,null,0]
[353,null,null,null,null,null,null,null,null,null,null,null,null,null,null,null,null,null,null,null,null,null,null,null,null,null,null,null,null,null,null,{"$f":"学校一覧!A359","v":353},{"$f":"学校一覧!B359","v":0},{"$f":"学校一覧!C359","v":0},{"$f":"学校一覧!D359","v":0},{"$f":"学校一覧!E359","v":"予備"},{"$f":"学校一覧!F359","v":0},null,null,null,null,null,0]
[354,null,null,null,null,null,null,null,null,null,null,null,null,null,null,null,null,null,null,null,null,null,null,null,null,null,null,null,null,null,null,{"$f":"学校一覧!A360","v":354},{"$f":"学校一覧!B360","v":0},{"$f":"学校一覧!C360","v":0},{"$f":"学校一覧!D360","v":0},{"$f":"学校一覧!E360","v":"予備"},{"$f":"学校一覧!F360","v":0},null,null,null,null,null,0]
[355,null,null,null,null,null,null,null,null,null,null,null,null,null,null,null,null,null,null,null,null,null,null,null,null,null,null,null,null,null,null,{"$f":"学校一覧!A361","v":355},{"$f":"学校一覧!B361","v":0},{"$f":"学校一覧!C361","v":0},{"$f":"学校一覧!D361","v":0},{"$f":"学校一覧!E361","v":"予備"},{"$f":"学校一覧!F361","v":0},null,null,null,null,null,0]
[356,null,null,null,null,null,null,null,null,null,null,null,null,null,null,null,null,null,null,null,null,null,null,null,null,null,null,null,null,null,null,{"$f":"学校一覧!A362","v":356},{"$f":"学校一覧!B362","v":0},{"$f":"学校一覧!C362","v":0},{"$f":"学校一覧!D362","v":0},{"$f":"学校一覧!E362","v":"予備"},{"$f":"学校一覧!F362","v":0},null,null,null,null,null,0]
[357,null,null,null,null,null,null,null,null,null,null,null,null,null,null,null,null,null,null,null,null,null,null,null,null,null,null,null,null,null,null,{"$f":"学校一覧!A363","v":357},{"$f":"学校一覧!B363","v":0},{"$f":"学校一覧!C363","v":0},{"$f":"学校一覧!D363","v":0},{"$f":"学校一覧!E363","v":"予備"},{"$f":"学校一覧!F363","v":0},null,null,null,null,null,0]
[358,null,null,null,null,null,null,null,null,null,null,null,null,null,null,null,null,null,null,null,null,null,null,null,null,null,null,null,null,null,null,{"$f":"学校一覧!A364","v":358},{"$f":"学校一覧!B364","v":0},{"$f":"学校一覧!C364","v":0},{"$f":"学校一覧!D364","v":0},{"$f":"学校一覧!E364","v":"予備"},{"$f":"学校一覧!F364","v":0},null,null,null,null,null,0]
[359,null,null,null,null,null,null,null,null,null,null,null,null,null,null,null,null,null,null,null,null,null,null,null,null,null,null,null,null,null,null,{"$f":"学校一覧!A365","v":359},{"$f":"学校一覧!B365","v":0},{"$f":"学校一覧!C365","v":0},{"$f":"学校一覧!D365","v":0},{"$f":"学校一覧!E365","v":"予備"},{"$f":"学校一覧!F365","v":0},null,null,null,null,null,0]
[360,null,null,null,null,null,null,null,null,null,null,null,null,null,null,null,null,null,null,null,null,null,null,null,null,null,null,null,null,null,null,{"$f":"学校一覧!A366","v":360},{"$f":"学校一覧!B366","v":0},{"$f":"学校一覧!C366","v":0},{"$f":"学校一覧!D366","v":0},{"$f":"学校一覧!E366","v":"予備"},{"$f":"学校一覧!F366","v":0},null,null,null,null,null,0]
[361,null,null,null,null,null,null,null,null,null,null,null,null,null,null,null,null,null,null,null,null,null,null,null,null,null,null,null,null,null,null,{"$f":"学校一覧!A367","v":361},{"$f":"学校一覧!B367","v":0},{"$f":"学校一覧!C367","v":0},{"$f":"学校一覧!D367","v":0},{"$f":"学校一覧!E367","v":"予備"},{"$f":"学校一覧!F367","v":0},null,null,null,null,null,0]
[362,null,null,null,null,null,null,null,null,null,null,null,null,null,null,null,null,null,null,null,null,null,null,null,null,null,null,null,null,null,null,{"$f":"学校一覧!A368","v":362},{"$f":"学校一覧!B368","v":0},{"$f":"学校一覧!C368","v":0},{"$f":"学校一覧!D368","v":0},{"$f":"学校一覧!E368","v":"予備"},{"$f":"学校一覧!F368","v":0},null,null,null,null,null,0]
[363,null,null,null,null,null,null,null,null,null,null,null,null,null,null,null,null,null,null,null,null,null,null,null,null,null,null,null,null,null,null,{"$f":"学校一覧!A369","v":363},{"$f":"学校一覧!B369","v":0},{"$f":"学校一覧!C369","v":0},{"$f":"学校一覧!D369","v":0},{"$f":"学校一覧!E369","v":"予備"},{"$f":"学校一覧!F369","v":0},null,null,null,null,null,0]
[364,null,null,null,null,null,null,null,null,null,null,null,null,null,null,null,null,null,null,null,null,null,null,null,null,null,null,null,null,null,null,{"$f":"学校一覧!A370","v":364},{"$f":"学校一覧!B370","v":0},{"$f":"学校一覧!C370","v":0},{"$f":"学校一覧!D370","v":0},{"$f":"学校一覧!E370","v":"予備"},{"$f":"学校一覧!F370","v":0},null,null,null,null,null,0]
[365,null,null,null,null,null,null,null,null,null,null,null,null,null,null,null,null,null,null,null,null,null,null,null,null,null,null,null,null,null,null,{"$f":"学校一覧!A371","v":365},{"$f":"学校一覧!B371","v":0},{"$f":"学校一覧!C371","v":0},{"$f":"学校一覧!D371","v":0},{"$f":"学校一覧!E371","v":"予備"},{"$f":"学校一覧!F371","v":0},null,null,null,null,null,0]
[366,null,null,null,null,null,null,null,null,null,null,null,null,null,null,null,null,null,null,null,null,null,null,null,null,null,null,null,null,null,null,{"$f":"学校一覧!A372","v":366},{"$f":"学校一覧!B372","v":0},{"$f":"学校一覧!C372","v":0},{"$f":"学校一覧!D372","v":0},{"$f":"学校一覧!E372","v":"予備"},{"$f":"学校一覧!F372","v":0},null,null,null,null,null,0]
[367,null,null,null,null,null,null,null,null,null,null,null,null,null,null,null,null,null,null,null,null,null,null,null,null,null,null,null,null,null,null,{"$f":"学校一覧!A373","v":367},{"$f":"学校一覧!B373","v":0},{"$f":"学校一覧!C373","v":0},{"$f":"学校一覧!D373","v":0},{"$f":"学校一覧!E373","v":"予備"},{"$f":"学校一覧!F373","v":0},null,null,null,null,null,0]
[368,null,null,null,null,null,null,null,null,null,null,null,null,null,null,null,null,null,null,null,null,null,null,null,null,null,null,null,null,null,null,{"$f":"学校一覧!A374","v":368},{"$f":"学校一覧!B374","v":0},{"$f":"学校一覧!C374","v":0},{"$f":"学校一覧!D374","v":0},{"$f":"学校一覧!E374","v":"予備"},{"$f":"学校一覧!F374","v":0},null,null,null,null,null,0]
[369,null,null,null,null,null,null,null,null,null,null,null,null,null,null,null,null,null,null,null,null,null,null,null,null,null,null,null,null,null,null,{"$f":"学校一覧!A375","v":369},{"$f":"学校一覧!B375","v":0},{"$f":"学校一覧!C375","v":0},{"$f":"学校一覧!D375","v":0},{"$f":"学校一覧!E375","v":"予備"},{"$f":"学校一覧!F375","v":0},null,null,null,null,null,0]
[370,null,null,null,null,null,null,null,null,null,null,null,null,null,null,null,null,null,null,null,null,null,null,null,null,null,null,null,null,null,null,{"$f":"学校一覧!A376","v":370},{"$f":"学校一覧!B376","v":0},{"$f":"学校一覧!C376","v":0},{"$f":"学校一覧!D376","v":0},{"$f":"学校一覧!E376","v":"予備"},{"$f":"学校一覧!F376","v":0},null,null,null,null,null,0]
[371]
[372]
[373]

{"sheet":"大会負担金集計表","index":2,"n_rows":418,"n_cols":43,"rows_kept":418,"cut":false,"hidden":true,"merged":[[205,4,205,6],[205,7,205,8],[205,9,205,10],[205,11,205,13],[203,4,203,6],[203,7,203,8],[203,9,203,10],[203,11,203,13],[204,4,204,6],[204,7,204,8],[204,9,204,10],[204,11,204,13],[201,4,201,6],[201,7,201,8],[201,9,201,10],[201,11,201,13],[202,4,202,6],[202,7,202,8],[202,9,202,10],[202,11,202,13],[199,4,199,6],[199,7,199,8],[199,9,199,10],[199,11,199,13],[200,4,200,6],[200,7,200,8],[200,9,200,10],[200,11,200,13],[197,4,197,6],[197,7,197,8],[197,9,197,10],[197,11,197,13],[198,4,198,6],[198,7,198,8],[198,9,198,10],[198,11,198,13],[195,4,195,6],[195,7,195,8],[195,9,195,10],[195,11,195,13],[196,4,196,6],[196,7,196,8],[196,9,196,10],[196,11,196,13],[193,4,193,6],[193,7,193,8],[193,9,193,10],[193,11,193,13],[194,4,194,6],[194,7,194,8],[194,9,194,10],[194,11,194,13],[191,4,191,6],[191,7,191,8],[191,9,191,10],[191,11,191,13],[192,4,192,6],[192,7,192,8],[192,9,192,10],[192,11,192,13],[189,4,189,6],[189,7,189,8],[189,9,189,10],[189,11,189,13],[190,4,190,6],[190,7,190,8],[190,9,190,10],[190,11,190,13],[187,4,187,6],[187,7,187,8],[187,9,187,10],[187,11,187,13],[188,4,188,6],[188,7,188,8],[188,9,188,10],[188,11,188,13],[181,4,181,6],[181,7,181,8],[181,9,181,10],[181,11,181,13],[186,4,186,6],[186,7,186,8],[186,9,186,10],[186,11,186,13],[184,4,184,6],[184,7,184,8],[184,9,184,10],[184,11,184,13],[185,4,185,6],[185,7,185,8],[185,9,185,10],[185,11,185,13],[182,4,182,6],[182,7,182,8],[182,9,182,10],[182,11,182,13],[183,4,183,6],[183,7,183,8],[183,9,183,10],[183,11,183,13],[180,4,180,6],[180,7,180,8],[180,9,180,10],[180,11,180,13],[178,4,178,6],[178,7,178,8],[178,9,178,10],[178,11,178,13],[179,4,179,6],[179,7,179,8],[179,9,179,10],[179,11,179,13],[176,4,176,6],[176,7,176,8],[176,9,176,10],[176,11,176,13],[177,4,177,6],[177,7,177,8],[177,9,177,10],[177,11,177,13],[174,4,174,6],[174,7,174,8],[174,9,174,10],[174,11,174,13],[175,4,175,6],[175,7,175,8],[175,9,175,10],[175,11,175,13],[172,4,172,6],[172,7,172,8],[172,9,172,10],[172,11,172,13],[173,4,173,6],[173,7,173,8],[173,9,173,10],[173,11,173,13],[170,4,170,6],[170,7,170,8],[170,9,170,10],[170,11,170,13],[171,4,171,6],[171,7,171,8],[171,9,171,10],[171,11,171,13],[168,4,168,6],[168,7,168,8],[168,9,168,10],[168,11,168,13],[169,4,169,6],[169,7,169,8],[169,9,169,10],[169,11,169,13],[166,4,166,6],[166,7,166,8],[166,9,166,10],[166,11,166,13],[167,4,167,6],[167,7,167,8],[167,9,167,10],[167,11,167,13],[164,4,164,6],[164,7,164,8],[164,9,164,10],[164,11,164,13],[165,4,165,6],[165,7,165,8],[165,9,165,10],[165,11,165,13],[162,4,162,6],[162,7,162,8],[162,9,162,10],[162,11,162,13],[163,4,163,6],[163,7,163,8],[163,9,163,10],[163,11,163,13],[160,4,160,6],[160,7,160,8],[160,9,160,10],[160,11,160,13],[161,4,161,6],[161,7,161,8],[161,9,161,10],[161,11,161,13],[158,4,158,6],[158,7,158,8],[158,9,158,10],[158,11,158,13],[159,4,159,6],[159,7,159,8],[159,9,159,10],[159,11,159,13],[156,4,156,6],[156,7,156,8],[156,9,156,10],[156,11,156,13],[157,4,157,6],[157,7,157,8],[157,9,157,10],[157,11,157,13],[154,4,154,6],[154,7,154,8],[154,9,154,10],[154,11,154,13],[155,4,155,6],[155,7,155,8],[155,9,155,10],[155,11,155,13],[152,4,152,6],[152,7,152,8],[152,9,152,10],[152,11,152,13],[153,4,153,6],[153,7,153,8],[153,9,153,10],[153,11,153,13],[150,4,150,6],[150,7,150,8],[150,9,150,10],[150,11,150,13],[151,4,151,6],[151,7,151,8],[151,9,151,10],[151,11,151,13],[148,4,148,6],[148,7,148,8],[148,9,148,10],[148,11,148,13],[149,4,149,6],[149,7,149,8],[149,9,149,10],[149,11,149,13],[146,4,146,6],[146,7,146,8],[146,9,146,10],[146,11,146,13],[147,4,147,6],[147,7,147,8],[147,9,147,10],[147,11,147,13],[124,11,124,13],[124,9,124,10],[124,7,124,8],[124,4,124,6],[123,11,123,13],[123,9,123,10],[123,7,123,8],[123,4,123,6],[126,11,126,13],[126,9,126,10],[126,7,126,8],[126,4,126,6],[125,11,125,13],[125,9,125,10],[125,7,125,8],[125,4,125,6],[128,11,128,13],[128,9,128,10],[128,7,128,8],[128,4,128,6],[127,11,127,13],[127,9,127,10],[127,7,127,8],[127,4,127,6],[130,11,130,13],[130,9,130,10],[130,7,130,8],[130,4,130,6],[129,11,129,13],[129,9,129,10],[129,7,129,8],[129,4,129,6],[132,11,132,13],[132,9,132,10],[132,7,132,8],[132,4,132,6],[131,11,131,13],[131,9,131,10],[131,7,131,8],[131,4,131,6],[134,11,134,13],[134,9,134,10],[134,7,134,8],[134,4,134,6],[133,11,133,13],[133,9,133,10],[133,7,133,8],[133,4,133,6],[136,11,136,13],[136,9,136,10],[136,7,136,8],[136,4,136,6],[135,11,135,13],[135,9,135,10],[135,7,135,8],[135,4,135,6],[138,11,138,13],[138,9,138,10],[138,7,138,8],[138,4,138,6],[137,11,137,13],[137,9,137,10],[137,7,137,8],[137,4,137,6],[140,11,140,13],[140,9,140,10],[140,7,140,8],[140,4,140,6],[139,11,139,13],[139,9,139,10],[139,7,139,8],[139,4,139,6],[142,11,142,13],[142,9,142,10],[142,7,142,8],[142,4,142,6],[141,11,141,13],[141,9,141,10],[141,7,141,8],[141,4,141,6],[145,11,145,13],[145,9,145,10],[145,7,145,8],[145,4,145,6],[144,11,144,13],[144,9,144,10],[120,4,120,6],[120,7,120,8],[120,9,120,10],[120,11,120,13],[121,4,121,6],[121,7,121,8],[121,9,121,10],[121,11,121,13],[144,7,144,8],[144,4,144,6],[143,11,143,13],[143,9,143,10],[143,7,143,8],[143,4,143,6],[122,4,122,6],[122,7,122,8],[122,9,122,10],[122,11,122,13],[118,4,118,6],[118,7,118,8],[118,9,118,10],[118,11,118,13],[119,4,119,6],[119,7,119,8],[119,9,119,10],[119,11,119,13],[116,4,116,6],[116,7,116,8],[116,9,116,10],[116,11,116,13],[117,4,117,6],[117,7,117,8],[117,9,117,10],[117,11,117,13],[114,4,114,6],[114,7,114,8],[114,9,114,10],[114,11,114,13],[115,4,115,6],[115,7,115,8],[115,9,115,10],[115,11,115,13],[112,4,112,6],[112,7,112,8],[112,9,112,10],[112,11,112,13],[113,4,113,6],[113,7,113,8],[113,9,113,10],[113,11,113,13],[110,4,110,6],[110,7,110,8],[110,9,110,10],[110,11,110,13],[111,4,111,6],[111,7,111,8],[111,9,111,10],[111,11,111,13],[108,4,108,6],[108,7,108,8],[108,9,108,10],[108,11,108,13],[109,4,109,6],[109,7,109,8],[109,9,109,10],[109,11,109,13],[106,4,106,6],[106,7,106,8],[106,9,106,10],[106,11,106,13],[107,4,107,6],[107,7,107,8],[107,9,107,10],[107,11,107,13],[104,4,104,6],[104,7,104,8],[104,9,104,10],[104,11,104,13],[105,4,105,6],[105,7,105,8],[105,9,105,10],[105,11,105,13],[102,4,102,6],[102,7,102,8],[102,9,102,10],[102,11,102,13],[103,4,103,6],[103,7,103,8],[103,9,103,10],[103,11,103,13],[100,4,100,6],[100,7,100,8],[100,9,100,10],[100,11,100,13],[101,4,101,6],[101,7,101,8],[101,9,101,10],[101,11,101,13],[98,4,98,6],[98,7,98,8],[98,9,98,10],[98,11,98,13],[99,4,99,6],[99,7,99,8],[99,9,99,10],[99,11,99,13],[96,4,96,6],[96,7,96,8],[96,9,96,10],[96,11,96,13],[97,4,97,6],[97,7,97,8],[97,9,97,10],[97,11,97,13],[94,4,94,6],[94,7,94,8],[94,9,94,10],[94,11,94,13],[95,4,95,6],[95,7,95,8],[95,9,95,10],[95,11,95,13],[92,4,92,6],[92,7,92,8],[92,9,92,10],[92,11,92,13],[93,4,93,6],[93,7,93,8],[93,9,93,10],[93,11,93,13],[90,4,90,6],[90,7,90,8],[90,9,90,10],[90,11,90,13],[91,4,91,6],[91,7,91,8],[91,9,91,10],[91,11,91,13],[88,4,88,6],[88,7,88,8],[88,9,88,10],[88,11,88,13],[89,4,89,6],[89,7,89,8],[89,9,89,10],[89,11,89,13],[86,4,86,6],[86,7,86,8],[86,9,86,10],[86,11,86,13],[87,4,87,6],[87,7,87,8],[87,9,87,10],[87,11,87,13],[84,4,84,6],[84,7,84,8],[84,9,84,10],[84,11,84,13],[85,4,85,6],[85,7,85,8],[85,9,85,10],[85,11,85,13],[82,4,82,6],[82,7,82,8],[82,9,82,10],[82,11,82,13],[83,4,83,6],[83,7,83,8],[83,9,83,10],[83,11,83,13],[80,4,80,6],[80,7,80,8],[80,9,80,10],[80,11,80,13],[81,4,81,6],[81,7,81,8],[81,9,81,10],[81,11,81,13],[78,4,78,6],[78,7,78,8],[78,9,78,10],[78,11,78,13],[79,4,79,6],[79,7,79,8],[79,9,79,10],[79,11,79,13],[76,4,76,6],[76,7,76,8],[76,9,76,10],[76,11,76,13],[77,4,77,6],[77,7,77,8],[77,9,77,10],[77,11,77,13],[74,4,74,6],[74,7,74,8],[74,9,74,10],[74,11,74,13],[75,4,75,6],[75,7,75,8],[75,9,75,10],[75,11,75,13],[72,4,72,6],[72,7,72,8],[72,9,72,10],[72,11,72,13],[73,4,73,6],[73,7,73,8],[73,9,73,10],[73,11,73,13],[70,4,70,6],[70,7,70,8],[70,9,70,10],[70,11,70,13],[71,4,71,6],[71,7,71,8],[71,9,71,10],[71,11,71,13],[68,4,68,6],[68,7,68,8],[68,9,68,10],[68,11,68,13],[69,4,69,6],[69,7,69,8],[69,9,69,10],[69,11,69,13],[66,4,66,6],[66,7,66,8],[66,9,66,10],[66,11,66,13],[67,4,67,6],[67,7,67,8],[67,9,67,10],[67,11,67,13],[64,4,64,6],[64,7,64,8],[64,9,64,10],[64,11,64,13],[65,4,65,6],[65,7,65,8],[65,9,65,10],[65,11,65,13],[62,4,62,6],[62,7,62,8],[62,9,62,10],[62,11,62,13],[63,4,63,6],[63,7,63,8],[63,9,63,10],[63,11,63,13],[60,4,60,6],[60,7,60,8],[60,9,60,10],[60,11,60,13],[61,4,61,6],[61,7,61,8],[61,9,61,10],[61,11,61,13],[43,11,43,13],[43,9,43,10],[43,7,43,8],[43,4,43,6],[42,11,42,13],[42,9,42,10],[42,7,42,8],[42,4,42,6],[45,11,45,13],[45,9,45,10],[45,7,45,8],[45,4,45,6],[44,11,44,13],[44,9,44,10],[44,7,44,8],[44,4,44,6],[47,11,47,13],[47,9,47,10],[47,7,47,8],[47,4,47,6],[46,11,46,13],[46,9,46,10],[46,7,46,8],[46,4,46,6],[49,11,49,13],[49,9,49,10],[49,7,49,8],[49,4,49,6],[48,11,48,13],[48,9,48,10],[48,7,48,8],[48,4,48,6],[50,11,50,13],[50,9,50,10],[50,7,50,8],[50,4,50,6],[53,11,53,13],[53,9,53,10],[53,7,53,8],[53,4,53,6],[52,11,52,13],[52,9,52,10],[52,7,52,8],[52,4,52,6],[57,7,57,8],[57,4,57,6],[56,11,56,13],[56,9,56,10],[56,7,56,8],[56,4,56,6],[51,11,51,13],[51,9,51,10],[51,7,51,8],[51,4,51,6],[59,11,59,13],[59,9,59,10],[59,7,59,8],[59,4,59,6],[58,11,58,13],[58,9,58,10],[58,7,58,8],[58,4,58,6],[40,7,40,8],[40,9,40,10],[40,11,40,13],[41,7,41,8],[41,9,41,10],[41,11,41,13],[55,11,55,13],[55,9,55,10],[55,7,55,8],[55,4,55,6],[54,11,54,13],[54,9,54,10],[54,7,54,8],[54,4,54,6],[57,11,57,13],[57,9,57,10],[38,7,38,8],[38,9,38,10],[38,11,38,13],[39,7,39,8],[39,9,39,10],[39,11,39,13],[36,7,36,8],[36,9,36,10],[36,11,36,13],[37,7,37,8],[37,9,37,10],[37,11,37,13],[34,7,34,8],[34,9,34,10],[34,11,34,13],[35,7,35,8],[35,9,35,10],[35,11,35,13],[32,7,32,8],[32,9,32,10],[32,11,32,13],[33,7,33,8],[33,9,33,10],[33,11,33,13],[30,7,30,8],[30,9,30,10],[30,11,30,13],[31,7,31,8],[31,9,31,10],[31,11,31,13],[28,7,28,8],[28,9,28,10],[28,11,28,13],[29,7,29,8],[29,9,29,10],[29,11,29,13],[26,7,26,8],[26,9,26,10],[26,11,26,13],[27,7,27,8],[27,9,27,10],[27,11,27,13],[23,9,23,10],[23,11,23,13],[24,7,24,8],[24,9,24,10],[24,11,24,13],[25,7,25,8],[25,9,25,10],[25,11,25,13],[39,4,39,6],[40,4,40,6],[41,4,41,6],[21,7,21,8],[21,9,21,10],[21,11,21,13],[22,7,22,8],[22,9,22,10],[22,11,22,13],[23,7,23,8],[33,4,33,6],[34,4,34,6],[35,4,35,6],[36,4,36,6],[37,4,37,6],[38,4,38,6],[27,4,27,6],[28,4,28,6],[29,4,29,6],[30,4,30,6],[31,4,31,6],[32,4,32,6],[21,4,21,6],[22,4,22,6],[206,4,206,6],[206,7,206,8],[206,9,206,10],[206,11,206,13],[23,4,23,6],[24,4,24,6],[25,4,25,6],[26,4,26,6],[6,10,6,13],[8,11,8,13],[10,11,10,13],[12,3,12,13],[14,3,14,13],[20,4,20,6],[20,7,20,8],[15,3,15,4],[16,3,16,4],[17,5,17,6],[18,10,18,12],[17,3,18,4],[15,5,15,13],[20,9,20,10],[20,11,20,13],[17,11,17,12]]}
[1,2,3,4,5,6,7,8,9,10,11,12,13,14,15,16,17,18,19,20,21,22,23,24,25,26,27,28,29,30,31,32,33,34,35,36,37,38,39,40,41,42,43]
[2]
[3]
[4]
[5,null,null,"広島市中学校体育連盟　　",null,"市中体連大会負担金納入集計表様式"]
[6,null,null,"　市中体連専門委員長　→　事務局"]
[7,null,null,null,null,null,null,null,null,null,{"$f":"預り証!I26&\" 年\"&預り証!L26&\" 月\"&預り証!O26&\" 日\"","v":"令和5 年5 月19 日"}]
[8,null,null,"広島市中学校体育連盟会長様"]
[9,null,null,null,null,null,null,null,"専門委員会名",null,null,"水泳競技"]
[10]
[11,null,null,null,null,null,null,null,"専門委員長名",null,null,{"$f":"預り証!M31","v":"藤田 智行"}]
[12]
[13,null,null,"市中体連大会負担金集計表"]
[14]
[15,null,null,"大会参加の生徒の負担金が集計できたので納入します"]
[16,null,null,"大  会  名",null,"広島市中学校総合体育大会（水泳競技の部）"]
[17,null,null,"登録選手数",null,"男子",{"$f":"預り証!AO3","v":11},"名　","女子",{"$f":"預り証!AP3","v":0},"名","合計",{"$f":"預り証!AQ3","v":11},"名"]
[18,null,null,"大会負担金",null,{"$f":"預り証!I15","v":1100},null,"円×",{"$f":"M17","v":11},"名分",null,{"$f":"預り証!AQ2","v":1},null,"校分"]
[19,null,null,null,null,null,null,null,null,null,{"$f":"F18*I18","v":12100},null,null,"円"]
[20]
[21,null,null,"No.","学校名",null,null,"男子",null,"女子",null,"男女合計"]
[22,1,null,1,"広島市立幟町中学校",null,null,11,null,null,null,11]
[23,2,null,"合計",null,null,null,11,null,0,null,11]
[24,3]
[25,4]
[26,5]
[27,6]
[28,7]
[29,8]
[30,9]
[31,10]
[32,11]
[33,12]
[34,13]
[35,14]
[36,15]
[37,16]
[38,17]
[39,18]
[40,19]
[41,20]
[42,21]
[43,22]
[44,23]
[45,24]
[46,25]
[47,26]
[48,27]
[49,28]
[50,29]
[51,30]
[52,31]
[53,32]
[54,33]
[55,34]
[56,35]
[57,36]
[58,37]
[59,38]
[60,39]
[61,40]
[62,41]
[63,42]
[64,43]
[65,44]
[66,45]
[67,46]
[68,47]
[69,48]
[70,49]
[71,50]
[72,51]
[73,52]
[74,53]
[75,54]
[76,55]
[77,56]
[78,57]
[79,58]
[80,59]
[81,60]
[82,61]
[83,62]
[84,63]
[85,64]
[86,65]
[87,66]
[88,67]
[89,68]
[90,69]
[91,70]
[92,71]
[93,72]
[94,73]
[95,74]
[96,75]
[97,76]
[98,77]
[99,78]
[100,79]
[101,80]
[102,81]
[103,82]
[104,83]
[105,84]
[106,85]
[107,86]
[108,87]
[109,88]
[110,89]
[111,90]
[112,91]
[113,92]
[114,93]
[115,94]
[116,95]
[117,96]
[118,97]
[119,98]
[120,99]
[121,100]
[122,101]
[123,102]
[124,103]
[125,104]
[126,105]
[127,106]
[128,107]
[129,108]
[130,109]
[131,110]
[132,111]
[133,112]
[134,113]
[135,114]
[136,115]
[137,116]
[138,117]
[139,118]
[140,119]
[141,120]
[142,121]
[143,122]
[144,123]
[145,124]
[146,125]
[147,126]
[148,127]
[149,128]
[150,129]
[151,130]
[152,131]
[153,132]
[154,133]
[155,134]
[156,135]
[157,136]
[158,137]
[159,138]
[160,139]
[161,140]
[162,141]
[163,142]
[164,143]
[165,144]
[166,145]
[167,146]
[168,147]
[169,148]
[170,149]
[171,150]
[172,151]
[173,152]
[174,153]
[175,154]
[176,155]
[177,156]
[178,157]
[179,158]
[180,159]
[181,160]
[182,161]
[183,162]
[184,163]
[185,164]
[186,165]
[187,166]
[188,167]
[189,168]
[190,169]
[191,170]
[192,171]
[193,172]
[194,173]
[195,174]
[196,175]
[197,176]
[198,177]
[199,178]
[200,179]
[201,180]
[202,181]
[203,182]
[204,183]
[205,184]
[206,185]
[]
[]
[]
[]
[]
[]
[]
[]
[]
[]
[]
[]
[]
[]
[]
[]
[]
[]
[]
[]
[]
[]
[]
[]
[]
[]
[]
[]
[]
[]
[]
[]
[]
[]
[]
[]
[]
[]
[]
[]
[]
[]
[]
[]
[]
[]
[]
[]
[]
[]
[]
[]
[]
[]
[]
[]
[]
[]
[]
[]
[]
[]
[]
[]
[]
[]
[]
[]
[]
[]
[]
[]
[]
[]
[]
[]
[]
[]
[]
[]
[]
[]
[]
[]
[]
[]
[]
[]
[]
[]
[]
[]
[]
[]
[]
[]
[]
[]
[]
[]
[]
[]
[]
[]
[]
[]
[]
[]
[]
[]
[]
[]
[]
[]
[]
[]
[]
[]
[]
[]
[]
[]
[]
[]
[]
[]
[]
[]
[]
[]
[]
[]
[]
[]
[]
[]
[]
[]
[]
[]
[]
[]
[]
[]
[]
[]
[]
[]
[]
[]
[]
[]
[]
[]
[]
[]
[]
[]
[]
[]
[]
[]
[]
[]
[]
[]
[]
[]
[]
[]
[]
[]
[]
[]
[]
[]
[]
[]
[]
[]
[]
[]
[]
[]
[]
[]
[]
[]
[]
[]
[]
[null,null,null,"合計",null,null,null,"合計を入れる","合計男子","合計女子",null,"合計男女"]
[]
[]
[]
[]
[]
[]
[]
[]
[]
[]
[]
[]
[]
[]
[]
[]
[]
[]
[null,null,null,"合計",null,null,null,"合計を入れる","合計男子","合計女子",null,"合計男女"]
[null,null,null,"合計",null,null,null,"合計を入れる","合計男子","合計女子",null,"合計男女"]

{"sheet":"入力方法","index":3,"n_rows":52,"n_cols":55,"rows_kept":52,"cut":false,"hidden":true,"merged":[[41,21,41,23],[41,24,41,26],[41,27,41,29],[41,30,41,32],[41,33,41,35],[41,36,41,38],[44,6,45,15],[47,6,47,9],[47,11,47,13],[47,15,47,19],[47,32,47,34],[47,36,47,41],[41,39,41,41],[41,2,41,8],[41,9,41,11],[41,12,41,14],[41,15,41,17],[41,18,41,20],[40,48,40,50],[40,51,40,53],[40,54,40,56],[40,36,40,38],[41,48,41,50],[41,51,41,53],[41,54,41,56],[41,42,41,44],[41,45,41,47],[40,39,40,41],[40,2,40,8],[40,9,40,11],[40,12,40,14],[40,15,40,17],[40,18,40,20],[40,21,40,23],[39,27,39,29],[39,30,39,32],[39,33,39,35],[39,9,39,11],[39,12,39,14],[39,15,39,17],[39,18,39,20],[39,21,39,23],[39,24,39,26],[39,45,39,47],[40,24,40,26],[40,27,40,29],[40,30,40,32],[40,33,40,35],[39,36,39,38],[39,39,39,41],[40,42,40,44],[40,45,40,47],[39,48,39,50],[34,17,34,20],[38,2,38,8],[38,9,38,26],[38,27,38,32],[38,33,38,38],[38,39,38,44],[28,35,28,38],[29,3,30,12],[29,29,31,34],[29,35,29,38],[30,35,30,38],[31,3,32,12],[31,35,31,38],[32,31,35,56],[33,3,34,12],[34,13,34,16],[38,45,38,50],[38,51,38,53],[38,54,38,56],[39,51,39,53],[39,54,39,56],[39,42,39,44],[39,2,39,8],[23,3,24,12],[23,29,25,34],[23,35,23,38],[24,35,24,38],[25,3,26,12],[25,35,25,38],[26,29,28,34],[26,35,26,38],[27,3,28,12],[27,35,27,38],[17,46,17,50],[21,2,21,12],[21,13,21,27],[21,29,21,34],[21,35,21,38],[21,39,21,56],[12,7,13,21],[14,9,15,11],[14,13,15,17],[14,29,15,33],[14,35,15,53],[17,15,17,18],[17,20,17,22],[17,24,17,28],[17,36,17,40],[17,42,17,44],[1,1,1,2],[2,46,2,47],[2,52,2,53],[6,7,6,8],[10,7,11,21],[11,37,13,40],[11,41,13,43],[11,44,13,46],[11,47,13,49],[11,50,13,52]]}
[]
[null,"様式K",null,null,"（出場校　→　郡市委員長）",null,null,null,null,null,null,null,null,null,null,null,null,null,null,null,"大会参加申込書"]
[null,null,null,null,null,null,null,null,null,null,null,null,null,null,null,null,null,null,null,null,null,null,null,null,null,null,null,null,null,null,null,null,null,null,null,null,null,null,null,null,null,null,null,null,"令和",null,null,null,"年",null,null,"月",null,null,"日"]
[null,"広島県中学校体育連盟会長 様"]
[]
[]
[null,"　下記の通り，",null,null,null,"第",null,null,null,"回　広島県中学校水泳競技選手権大会（競泳競技）",null,null,null,null,null,null,null,null,null,null,null,null,null,null,null,null,null,null,null,null,null,null,null,"に別添一覧の選手が出場することを認め，参加申し込みを致します。"]
[]
[]
[null,null,"■出場校"]
[]
[null,null,null,"中学校名",null,null,null,null,null,null,null,null,null,null,null,null,null,null,null,null,null,null,"中学校",null,null,null,null,null,null,null,null,null,null,null,null,null,null,3,null,null,null,4]
[null,null,null,null,null,null,null,null,null,null,null,null,null,null,null,null,null,null,null,null,null,null,null,null,null,null,null,null,null,null,null,null,"団体登録番号"]
[null,null,null,"校長名",null,null,null,null,null,null,null,null,null,null,null,null,null,null,null,null,null,null,null,null,null,"印"]
[null,null,null,null,null,null,null,null,null,null,null,null,null,null,null,null,null,null,null,null,null,null,null,null,null,null,null,null,null,null,null,null,null,null,"市"]
[null,null,null,"所在地",null,null,null,"〒",null,null,null,null,"－",null,null,null,null,null,null,null,null,null,null,"広島県",null,null,null,null,null,null,null,null,null,null,"郡"]
[]
[null,null,null,null,null,null,null,null,null,null,null,null,"TEL",null,"（",null,null,null,null,"）",null,null,null,"－",null,null,null,null,null,null,null,null,null,"FAX",null,"（",null,null,null,null,null,"）",null,null,null,"－"]
[]
[]
[null,null,"■引率者",null,null,null,null,null,null,null,null,null,null,null,null,null,null,null,null,null,null,null,null,null,null,null,null,null,null,"■競技役員"]
[null,null,"引　率　者　名",null,null,null,null,null,null,null,null,null,null,"区　　　　分",null,null,null,null,null,null,null,null,null,null,null,null,null,null,null,"競　技　役　員　名",null,null,null,null,null,"確認事項",null,null,null,"チェック漏れがないようにお願いします。"]
[]
[null,null,null,null,null,null,null,null,null,null,null,null,null,null,null,null,null,null,null,null,null,null,null,null,null,null,null,null,null,null,null,null,null,null,null,"① 参加日程"]
[null,null,null,null,null,null,null,null,null,null,null,null,null,null,null,null,null,null,null,null,null,null,null,null,null,null,null,null,null,null,null,null,null,null,null,"② 区分"]
[null,null,null,null,null,null,null,null,null,null,null,null,null,null,null,null,null,null,null,null,null,null,null,null,null,null,null,null,null,null,null,null,null,null,null,"③ 審判資格"]
[null,null,null,null,null,null,null,null,null,null,null,null,null,null,null,null,null,null,null,null,null,null,null,null,null,null,null,null,null,null,null,null,null,null,null,"① 参加日程"]
[null,null,null,null,null,null,null,null,null,null,null,null,null,null,null,null,null,null,null,null,null,null,null,null,null,null,null,null,null,null,null,null,null,null,null,"② 区分"]
[null,null,null,null,null,null,null,null,null,null,null,null,null,null,null,null,null,null,null,null,null,null,null,null,null,null,null,null,null,null,null,null,null,null,null,"③ 審判資格"]
[null,null,null,null,null,null,null,null,null,null,null,null,null,null,null,null,null,null,null,null,null,null,null,null,null,null,null,null,null,null,null,null,null,null,null,"① 参加日程"]
[null,null,null,null,null,null,null,null,null,null,null,null,null,null,null,null,null,null,null,null,null,null,null,null,null,null,null,null,null,null,null,null,null,null,null,"② 区分"]
[null,null,null,null,null,null,null,null,null,null,null,null,null,null,null,null,null,null,null,null,null,null,null,null,null,null,null,null,null,null,null,null,null,null,null,"③ 審判資格"]
[null,null,null,null,null,null,null,null,null,null,null,null,null,null,null,null,null,null,null,null,null,null,null,null,null,null,null,null,null,null,null,"※　①②③のそれぞれの確認事項のチェックを忘れないようにお願いします。\n※　特例引率での大会参加の場合，競技役員は１日１名の記入お願いします。\n※　参加日程/区分の□にﾁｪｯｸを入れてください。"]
[]
[null,null,null,null,null,null,null,null,null,null,null,null,null,"　（　任命権者：",null,null,null,null,null,null,null,"教育委員会　）"]
[null,null,null,null,null,null,null,null,null,null,null,null,null,"※参加日程/区分の□にﾁｪｯｸを入れてください。"]
[]
[null,null,"■参加人数"]
[null,null,"種　目",null,null,null,null,null,null,"自　由　形",null,null,null,null,null,null,null,null,null,null,null,null,null,null,null,null,null,"背泳ぎ",null,null,null,null,null,"平泳ぎ",null,null,null,null,null,"ﾊﾞﾀﾌﾗｲ",null,null,null,null,null,"個人ﾒﾄﾞﾚｰ",null,null,null,null,null,"MR",null,null,"FR"]
[null,null,"距　離",null,null,null,null,null,null,"50m",null,null,"100m",null,null,"200m",null,null,"400m",null,null,"800m",null,null,"1500m",null,null,"100m",null,null,"200m",null,null,"100m",null,null,"200m",null,null,"100m",null,null,"200m",null,null,"200m",null,null,"400m",null,null,"400m",null,null,"400m"]
[null,null,"男　子",null,null,null,null,null,null,null,null,null,null,null,null,null,null,null,null,null,null,"-"]
[null,null,"女　子",null,null,null,null,null,null,null,null,null,null,null,null,null,null,null,null,null,null,null,null,null,"-"]
[]
[null,null,"■申し込み責任者　問い合わせ先",null,null,null,null,null,null,null,null,null,null,null,null,null,null,null,null,null,null,null,null,null,null,null,null,null,null,null,null,null,null,null,null,null,null,null,null,null,null,null,null,"※ﾘﾚｰ種目については，出場の場合に○印を記入してください。"]
[]
[null,null,null,"お名前"]
[]
[null,null,null,"TEL",null,"（",null,null,null,null,"）",null,null,null,"－",null,null,null,null,null,null,null,"携帯電話",null,null,null,"（",null,null,null,null,"）",null,null,null,"－"]
[]
[]
[null,null,"※ 参加申し込みにあたり，各中学校の担当者が，Web上での選手登録・年度更新・ｴﾝﾄﾘｰ等の入力を終えていること。",null,null,null,null,null,null,null,null,null,null,null,null,null,null,null,null,null,null,null,null,null,null,null,null,null,null,null,null,"※ 別添一覧の選手は，Webｴﾝﾄﾘｰされており，この一覧は，Web-SWMSYSからﾌﾟﾘﾝﾄｱｳﾄされたものであること。"]
[null,null,"※ 標記大会の申込にあたり，大会ﾌﾟﾛｸﾞﾗﾑ等及び報道発表（新聞・Webﾍﾟｰｼﾞ等）における選手名，学年，所属等の個人情報の記載について，本人・保護者の同意を得ていること。",null,null,null,null,null,null,null,null,null,null,null,null,null,null,null,null,null,null,null,null,null,null,null,null,null,null,null,null,null,null,null,null,null,null,null,null,null,null,null,null,null,null,null,null,null,"https://swim34.jp/"]

{"sheet":"令和３年度　改訂","index":4,"n_rows":52,"n_cols":55,"rows_kept":52,"cut":false,"hidden":true,"merged":[[38,54,38,56],[7,4,7,5],[7,6,7,8],[38,2,38,8],[41,2,41,8],[40,2,40,8],[39,2,39,8],[23,3,24,12],[33,3,34,12],[41,9,41,11],[12,7,13,21],[14,9,15,11],[14,13,15,17],[23,29,24,34],[26,29,27,34],[40,30,40,32],[31,3,32,12],[21,35,21,38],[24,35,24,38],[39,30,39,32],[38,27,38,32],[27,35,27,38],[21,29,21,34],[29,29,30,34],[41,18,41,20],[31,35,31,38],[30,35,30,38],[29,35,29,38],[29,3,30,12],[27,3,28,12],[23,35,23,38],[25,35,25,38],[28,35,28,38],[26,35,26,38],[39,15,39,17],[39,24,39,26],[41,33,41,35],[40,21,40,23],[41,12,41,14],[41,15,41,17],[40,27,40,29],[40,24,40,26],[41,24,41,26],[41,27,41,29],[41,21,41,23],[40,9,40,11],[40,12,40,14],[39,12,39,14],[1,1,1,2],[21,2,21,12],[38,9,38,26],[39,18,39,20],[39,21,39,23],[11,37,13,40],[11,41,13,43],[17,36,17,40],[39,27,39,29],[6,6,6,8],[6,4,6,5],[39,9,39,11],[34,13,34,16],[14,23,15,28],[14,29,15,53],[25,3,26,12],[2,49,2,50],[10,7,11,21],[2,46,2,47],[2,52,2,53],[17,15,17,18],[47,32,47,34],[38,45,38,50],[38,51,38,53],[21,13,21,27],[38,33,38,38],[21,39,21,56],[39,36,39,38],[39,51,39,53],[47,27,47,30],[47,36,47,41],[44,6,45,15],[47,6,47,9],[47,11,47,13],[47,15,47,19],[39,54,39,56],[40,54,40,56],[40,39,40,41],[41,51,41,53],[41,45,41,47],[41,48,41,50],[41,42,41,44],[41,39,41,41],[40,48,40,50],[39,42,39,44],[40,15,40,17],[17,20,17,22],[17,24,17,28],[41,54,41,56],[40,42,40,44],[11,50,13,52],[39,48,39,50],[39,33,39,35],[41,36,41,38],[17,42,17,44],[17,46,17,50],[11,44,13,46],[11,47,13,49],[40,51,40,53],[40,45,40,47],[32,31,35,56],[41,30,41,32],[40,33,40,35],[40,36,40,38],[38,39,38,44],[39,39,39,41],[39,45,39,47],[34,17,34,20],[40,18,40,20]]}
[]
[null,"様式K",null,null,"（出場校　→　郡市委員長）",null,null,null,null,null,null,null,null,null,null,null,null,null,null,null,"大会参加申込書"]
[null,null,null,null,null,null,null,null,null,null,null,null,null,null,null,null,null,null,null,null,null,null,null,null,null,null,null,null,null,null,null,null,null,null,null,null,null,null,null,null,null,null,null,null,"令和",null,{"$f":"IF(県大会入力シート!H3=\"\",\"\",県大会入力シート!H3)","v":4},null,"年",{"$f":"IF(県大会入力シート!J3=\"\",\"\",県大会入力シート!J3)","v":8},null,"月",{"$f":"IF(県大会入力シート!L3=\"\",\"\",県大会入力シート!L3)","v":2},null,"日"]
[null,"広島県中学校体育連盟会長 様"]
[]
[]
[null,"　下記の通り，",null,null,"第",null,{"$f":"IF(県大会入力シート!G5=\"\",\"\",県大会入力シート!G5)","v":2},null,null,"回　広島県中学校水泳競技選手権大会（競泳競技）",null,null,null,null,null,null,null,null,null,null,null,null,null,null,null,null,null,null,null,null,null,null,null,"に別添一覧の選手が出場することを認め，参加申し込みを致します。"]
[null,null,null,null,"第",null,{"$f":"IF(県大会入力シート!G6=\"\",\"\",県大会入力シート!G6)","v":""},null,null,"回　広島県中学校新人水泳競技大会"]
[]
[null,null,"■出場校"]
[null,null,null,null,null,null,null,{"$f":"IF(県大会入力シート!F8=\"\",\"\",県大会入力シート!F8)","v":"広島市立己斐中学校"}]
[null,null,null,"中学校名",null,null,null,null,null,null,null,null,null,null,null,null,null,null,null,null,null,null,"中学校",null,null,null,null,null,null,null,null,null,null,null,null,null,null,3,null,null,null,4,null,null,{"$f":"IF(県大会入力シート!H10=\"\",\"\",県大会入力シート!H10)","v":"A"},null,null,{"$f":"IF(県大会入力シート!I10=\"\",\"\",県大会入力シート!I10)","v":"3"},null,null,{"$f":"IF(県大会入力シート!J10=\"\",\"\",県大会入力シート!J10)","v":"0"}]
[null,null,null,null,null,null,null,{"$f":"IF(県大会入力シート!F12=\"\",\"\",県大会入力シート!F12)","v":"溝下　明美"},null,null,null,null,null,null,null,null,null,null,null,null,null,null,null,null,null,null,null,null,null,null,null,null,"団体登録番号"]
[null,null,null,"校長名",null,null,null,null,null,null,null,null,null,null,null,null,null,null,null,null,null,null,null,null,null,"印"]
[null,null,null,null,null,null,null,null,null,{"$f":"IF(県大会入力シート!G14=\"\",\"\",県大会入力シート!G14)","v":"733"},null,null,null,{"$f":"IF(県大会入力シート!J14=\"\",\"\",県大会入力シート!J14)","v":"0815"},null,null,null,null,null,null,null,null,null,"広島県",null,null,null,null,null,{"$f":"IF(県大会入力シート!I16=\"\",\"\",県大会入力シート!I16)","v":"広島市西区己斐上3-35-1"}]
[null,null,null,"所在地",null,null,null,"〒",null,null,null,null,"－"]
[]
[null,null,null,null,null,null,null,null,null,null,null,null,"TEL",null,"（",{"$f":"IF(県大会入力シート!F18=\"\",\"\",県大会入力シート!F18)","v":"082-271-2260"},null,null,null,"）",{"$f":"IF(県大会入力シート!K18=\"\",\"\",県大会入力シート!K18)","v":""},null,null,"－",{"$f":"IF(県大会入力シート!O18=\"\",\"\",県大会入力シート!O18)","v":""},null,null,null,null,null,null,null,null,"FAX",null,"（",{"$f":"IF(県大会入力シート!G20=\"\",\"\",県大会入力シート!G20)","v":""},null,null,null,null,"）",{"$f":"IF(県大会入力シート!K20=\"\",\"\",県大会入力シート!K20)","v":""},null,null,"－",{"$f":"IF(県大会入力シート!O20=\"\",\"\",県大会入力シート!O20)","v":""}]
[]
[]
[null,null,"■引率者",null,null,null,null,null,null,null,null,null,null,null,null,null,null,null,null,null,null,null,null,null,null,null,null,null,null,"■競技役員"]
[null,null,"引　率　者　名",null,null,null,null,null,null,null,null,null,null,"区　　　　分",null,null,null,null,null,null,null,null,null,null,null,null,null,null,null,"競　技　役　員　名",null,null,null,null,null,"確認事項",null,null,null,"チェック漏れがないようにお願いします。"]
[]
[null,null,null,{"$f":"IF(県大会入力シート!F23=\"\",\"\",県大会入力シート!F23)","v":"糸藤▲▲"},null,null,null,null,null,null,null,null,null,null,null,null,null,null,null,null,null,null,null,null,null,null,null,null,null,{"$f":"IF(県大会入力シート!F35=\"\",\"\",県大会入力シート!F35)","v":"井上▲▲"},null,null,null,null,null,"① 参加日程"]
[null,null,null,null,null,null,null,null,null,null,null,null,null,null,null,null,null,null,null,null,null,null,null,null,null,null,null,null,null,null,null,null,null,null,null,"② 区分"]
[null,null,null,{"$f":"IF(県大会入力シート!F25=\"\",\"\",県大会入力シート!F25)","v":""},null,null,null,null,null,null,null,null,null,null,null,null,null,null,null,null,null,null,null,null,null,null,null,null,null,null,null,null,null,null,null,"③ 審判資格"]
[null,null,null,null,null,null,null,null,null,null,null,null,null,null,null,null,null,null,null,null,null,null,null,null,null,null,null,null,null,{"$f":"IF(県大会入力シート!F37=\"\",\"\",県大会入力シート!F37)","v":""},null,null,null,null,null,"① 参加日程"]
[null,null,null,{"$f":"IF(県大会入力シート!F27=\"\",\"\",県大会入力シート!F27)","v":""},null,null,null,null,null,null,null,null,null,null,null,null,null,null,null,null,null,null,null,null,null,null,null,null,null,null,null,null,null,null,null,"② 区分"]
[null,null,null,null,null,null,null,null,null,null,null,null,null,null,null,null,null,null,null,null,null,null,null,null,null,null,null,null,null,null,null,null,null,null,null,"③ 審判資格"]
[null,null,null,{"$f":"IF(県大会入力シート!F29=\"\",\"\",県大会入力シート!F29)","v":""},null,null,null,null,null,null,null,null,null,null,null,null,null,null,null,null,null,null,null,null,null,null,null,null,null,{"$f":"IF(県大会入力シート!F39=\"\",\"\",県大会入力シート!F39)","v":""},null,null,null,null,null,"① 参加日程"]
[null,null,null,null,null,null,null,null,null,null,null,null,null,null,null,null,null,null,null,null,null,null,null,null,null,null,null,null,null,null,null,null,null,null,null,"② 区分"]
[null,null,null,{"$f":"IF(県大会入力シート!F31=\"\",\"\",県大会入力シート!F31)","v":""},null,null,null,null,null,null,null,null,null,null,null,null,null,null,null,null,null,null,null,null,null,null,null,null,null,null,null,null,null,null,null,"③ 審判資格"]
[null,null,null,null,null,null,null,null,null,null,null,null,null,null,null,null,null,null,null,null,null,null,null,null,null,null,null,null,null,null,null,"※　①②③のそれぞれの確認事項のチェックを忘れないようにお願いします。\n※　特例引率での大会参加の場合，競技役員は１日１名の記入お願いします。"]
[null,null,null,{"$f":"IF(県大会入力シート!F33=\"\",\"\",県大会入力シート!F33)","v":""}]
[null,null,null,null,null,null,null,null,null,null,null,null,null,"　（　任命権者：",null,null,null,{"$f":"IF(県大会入力シート!S33=\"\",\"\",県大会入力シート!S33)","v":""},null,null,null,"教育委員会　）"]
[null,null,null,null,null,null,null,null,null,null,null,null,null,"※参加日程/区分の□にﾁｪｯｸを入れてください。"]
[]
[null,null,"■参加人数"]
[null,null,"種　目",null,null,null,null,null,null,"自　由　形",null,null,null,null,null,null,null,null,null,null,null,null,null,null,null,null,null,"背泳ぎ",null,null,null,null,null,"平泳ぎ",null,null,null,null,null,"ﾊﾞﾀﾌﾗｲ",null,null,null,null,null,"個人ﾒﾄﾞﾚｰ",null,null,null,null,null,"MR",null,null,"FR"]
[null,null,"距　離",null,null,null,null,null,null,"50m",null,null,"100m",null,null,"200m",null,null,"400m",null,null,"800m",null,null,"1500m",null,null,"100m",null,null,"200m",null,null,"100m",null,null,"200m",null,null,"100m",null,null,"200m",null,null,"200m",null,null,"400m",null,null,"400m",null,null,"400m"]
[null,null,"男　子",null,null,null,null,null,null,{"$f":"IF(県大会入力シート!AA45=\"\",\"\",県大会入力シート!AA45)","v":0},null,null,{"$f":"IF(県大会入力シート!AD45=\"\",\"\",県大会入力シート!AD45)","v":0},null,null,{"$f":"IF(県大会入力シート!AG45=\"\",\"\",県大会入力シート!AG45)","v":0},null,null,{"$f":"IF(県大会入力シート!AJ45=\"\",\"\",県大会入力シート!AJ45)","v":0},null,null,"-",null,null,{"$f":"IF(県大会入力シート!AP45=\"\",\"\",県大会入力シート!AP45)","v":0},null,null,{"$f":"IF(県大会入力シート!AS45=\"\",\"\",県大会入力シート!AS45)","v":0},null,null,{"$f":"IF(県大会入力シート!AV45=\"\",\"\",県大会入力シート!AV45)","v":0},null,null,{"$f":"IF(県大会入力シート!AY45=\"\",\"\",県大会入力シート!AY45)","v":0},null,null,{"$f":"IF(県大会入力シート!BB45=\"\",\"\",県大会入力シート!BB45)","v":1},null,null,{"$f":"IF(県大会入力シート!BE45=\"\",\"\",県大会入力シート!BE45)","v":0},null,null,{"$f":"IF(県大会入力シート!BH45=\"\",\"\",県大会入力シート!BH45)","v":0},null,null,{"$f":"IF(県大会入力シート!BK45=\"\",\"\",県大会入力シート!BK45)","v":1},null,null,{"$f":"IF(県大会入力シート!BN45=\"\",\"\",県大会入力シート!BN45)","v":0},null,null,{"$f":"IF(県大会入力シート!BQ45=1,\"○\",\"\")","v":""},null,null,{"$f":"IF(県大会入力シート!BT45=1,\"○\",\"\")","v":""}]
[null,null,"女　子",null,null,null,null,null,null,{"$f":"IF(県大会入力シート!AA46=\"\",\"\",県大会入力シート!AA46)","v":0},null,null,{"$f":"IF(県大会入力シート!AD46=\"\",\"\",県大会入力シート!AD46)","v":0},null,null,{"$f":"IF(県大会入力シート!AG46=\"\",\"\",県大会入力シート!AG46)","v":0},null,null,{"$f":"IF(県大会入力シート!AJ46=\"\",\"\",県大会入力シート!AJ46)","v":0},null,null,{"$f":"IF(県大会入力シート!AM46=\"\",\"\",県大会入力シート!AM46)","v":0},null,null,"-",null,null,{"$f":"IF(県大会入力シート!AS46=\"\",\"\",県大会入力シート!AS46)","v":1},null,null,{"$f":"IF(県大会入力シート!AV46=\"\",\"\",県大会入力シート!AV46)","v":1},null,null,{"$f":"IF(県大会入力シート!AY46=\"\",\"\",県大会入力シート!AY46)","v":0},null,null,{"$f":"IF(県大会入力シート!BB46=\"\",\"\",県大会入力シート!BB46)","v":0},null,null,{"$f":"IF(県大会入力シート!BE46=\"\",\"\",県大会入力シート!BE46)","v":0},null,null,{"$f":"IF(県大会入力シート!BH46=\"\",\"\",県大会入力シート!BH46)","v":0},null,null,{"$f":"IF(県大会入力シート!BK46=\"\",\"\",県大会入力シート!BK46)","v":0},null,null,{"$f":"IF(県大会入力シート!BN46=\"\",\"\",県大会入力シート!BN46)","v":0},null,null,{"$f":"IF(県大会入力シート!BQ46=1,\"○\",\"\")","v":""},null,null,{"$f":"IF(県大会入力シート!BT46=1,\"○\",\"\")","v":""}]
[]
[null,null,"■申し込み責任者　問い合わせ先",null,null,null,null,null,null,null,null,null,null,null,null,null,null,null,null,null,null,null,null,null,null,null,null,null,null,null,null,null,null,null,null,null,null,null,null,null,null,null,null,null,null,null,null,"※ﾘﾚｰ種目については，出場の場合に○印"]
[null,null,null,null,null,null,{"$f":"IF(県大会入力シート!F61=\"\",\"\",県大会入力シート!F61)","v":"田中▲▲"}]
[null,null,null,"お名前"]
[]
[null,null,null,"TEL",null,"（",{"$f":"IF(県大会入力シート!G63=\"\",\"\",県大会入力シート!G63)","v":""},null,null,null,"）",{"$f":"IF(県大会入力シート!K63=\"\",\"\",県大会入力シート!K63)","v":""},null,null,"－",{"$f":"IF(県大会入力シート!O63=\"\",\"\",県大会入力シート!O63)","v":""},null,null,null,null,null,null,"携帯電話",null,null,null,"（",{"$f":"IF(県大会入力シート!G65=\"\",\"\",県大会入力シート!G65)","v":""},null,null,null,"）",{"$f":"IF(県大会入力シート!K65=\"\",\"\",県大会入力シート!K65)","v":""},null,null,"－",{"$f":"IF(県大会入力シート!O65=\"\",\"\",県大会入力シート!O65)","v":""}]
[]
[]
[null,null,"※ 参加申し込みにあたり，各中学校の担当者が，Web上での選手登録・年度更新・ｴﾝﾄﾘｰ等の入力を終えていること。",null,null,null,null,null,null,null,null,null,null,null,null,null,null,null,null,null,null,null,null,null,null,null,null,null,null,null,null,"※ 別添一覧の選手は，Webｴﾝﾄﾘｰされており，この一覧は，Web-SWMSYSからﾌﾟﾘﾝﾄｱｳﾄされたものであること。"]
[null,null,"※ 標記大会の申込にあたり，大会ﾌﾟﾛｸﾞﾗﾑ等及び報道発表（新聞・Webﾍﾟｰｼﾞ等）における選手名，学年，所属等の個人情報の記載について，本人・保護者の同意を得ていること。",null,null,null,null,null,null,null,null,null,null,null,null,null,null,null,null,null,null,null,null,null,null,null,null,null,null,null,null,null,null,null,null,null,null,null,null,null,null,null,null,null,null,null,null,null,"https://swim34.jp/"]

{"sheet":"県大会入力シート","index":5,"n_rows":182,"n_cols":80,"rows_kept":182,"cut":false,"hidden":true,"merged":[[43,20,43,21],[45,20,45,21],[60,1,64,1],[48,8,48,10],[49,5,50,7],[49,8,49,10],[50,8,50,10],[51,5,52,7],[51,8,51,10],[52,8,52,10],[22,5,22,10],[24,5,24,10],[26,5,26,10],[41,5,46,7],[47,5,48,7],[44,8,44,10],[45,8,45,10],[46,8,46,10],[47,8,47,10],[45,47,45,49],[91,36,91,41],[91,42,91,47],[91,48,91,50],[60,5,60,17],[53,5,54,7],[53,8,53,10],[54,8,54,10],[55,8,55,10],[56,8,56,10],[45,32,45,34],[45,35,45,37],[45,38,45,40],[45,41,45,43],[45,44,45,46],[2,5,2,6],[11,5,11,17],[13,6,13,7],[13,9,13,12],[7,5,7,17],[2,1,19,1],[42,26,42,43],[42,44,42,49],[42,50,42,55],[24,15,24,16],[22,15,22,16],[32,15,32,21],[30,15,30,16],[4,8,4,19],[17,5,17,16],[19,5,19,16],[41,8,41,10],[42,8,42,10],[22,1,38,1],[41,1,56,1],[15,5,15,7],[56,5,56,7],[55,5,55,7],[45,29,45,31],[42,56,42,61],[42,62,42,67],[42,68,42,70],[42,71,42,73],[43,26,43,28],[43,29,43,31],[43,32,43,34],[43,35,43,37],[43,38,43,40],[43,41,43,43],[43,44,43,46],[43,47,43,49],[43,50,43,52],[43,53,43,55],[43,56,43,58],[43,59,43,61],[43,62,43,64],[43,65,43,67],[43,68,43,70],[44,65,44,67],[44,68,44,70],[43,71,43,73],[44,26,44,28],[44,29,44,31],[44,32,44,34],[44,35,44,37],[44,38,44,40],[44,41,44,43],[44,44,44,46],[44,56,44,58],[44,59,44,61],[44,62,44,64],[44,47,44,49],[44,50,44,52],[45,71,45,73],[15,8,15,24],[45,53,45,55],[45,56,45,58],[45,59,45,61],[45,62,45,64],[45,65,45,67],[45,68,45,70],[44,71,44,73],[45,26,45,28],[28,5,28,10],[30,5,30,10],[32,5,32,10],[34,5,34,10],[36,5,36,10],[38,5,38,10],[34,15,34,17],[34,20,34,21],[34,24,34,25],[36,15,36,17],[36,20,36,21],[36,24,36,25],[28,15,28,16],[26,15,26,16],[91,51,91,53],[92,6,92,8],[92,9,92,11],[92,12,92,14],[92,15,92,17],[92,18,92,20],[92,30,92,32],[38,24,38,25],[91,6,91,23],[91,24,91,29],[91,30,91,35],[60,20,60,21],[38,15,38,17],[38,20,38,21],[62,5,62,15],[64,5,64,15],[45,50,45,52],[44,53,44,55],[92,33,92,35],[92,36,92,38],[92,39,92,41],[92,42,92,44],[92,45,92,47],[43,8,43,10],[93,27,93,29],[93,39,93,41],[93,42,93,44],[93,45,93,47],[92,48,92,50],[92,51,92,53],[93,6,93,8],[93,9,93,11],[93,12,93,14],[93,15,93,17],[93,18,93,20],[92,21,92,23],[92,24,92,26],[92,27,92,29],[0,1,0,3],[94,39,94,41],[94,42,94,44],[94,45,94,47],[93,48,93,50],[93,51,93,53],[94,6,94,8],[94,9,94,11],[94,12,94,14],[94,15,94,17],[94,18,94,20],[94,48,94,50],[94,51,94,53],[94,30,94,32],[94,33,94,35],[94,36,94,38],[94,21,94,23],[94,24,94,26],[94,27,94,29],[93,30,93,32],[93,33,93,35],[93,36,93,38],[93,21,93,23],[93,24,93,26]]}
[null,"県大会",null,null,null,"※：入力必須項目"]
[]
[null,"学　校　情　報","※","日にち(作成日)",null,"令和",null,4,"年",8,"月",2,"日"]
[]
[null,null,"※","大会名",null,"第",{"$f":"IF(I5=\"広島県中学校水泳競技選手権大会（競泳競技）\",VLOOKUP(H3,J132:S161,7,),VLOOKUP(H3,J132:S161,10,))","v":2},"回　","広島県中学校新人水泳競技大会"]
[]
[]
[null,null,"※","中学校名",null,{"$f":"start!G8","v":"広島市立己斐中学校"}]
[]
[null,null,"※","団体登録番号",null,3,4,{"$f":"MID(VLOOKUP(F8,学校一覧,2,FALSE),3,1)","v":"A"},{"$f":"MID(VLOOKUP(F8,学校一覧,2,FALSE),4,1)","v":"3"},{"$f":"MID(VLOOKUP(F8,学校一覧,2,FALSE),5,1)","v":"0"}]
[]
[null,null,"※","校長名",null,{"$f":"start!G10","v":"溝下　明美"}]
[]
[null,null,"※","所在地",null,"〒",{"$f":"MID(VLOOKUP(F8,学校一覧,3,FALSE),1,3)","v":"733"},null,"-",{"$f":"MID(VLOOKUP(F8,学校一覧,3,FALSE),5,8)","v":"0815"},null,{"$f":"MID(VLOOKUP(K8,学校一覧,3),1,3)","v":{"$error":"#N/A"}}]
[]
[null,null,"※",null,null,"広島県",null,null,{"$f":"VLOOKUP(F8,学校一覧,4,FALSE)","v":"広島市西区己斐上3-35-1"}]
[]
[null,null,"※","Tel",null,{"$f":"VLOOKUP(F8,学校一覧,5,FALSE)","v":"082-271-2260"}]
[]
[null,null,"※","FAX",null,{"$f":"VLOOKUP(F8,学校一覧,6,FALSE)","v":"082-271-5499"}]
[]
[]
[null,"引率者・競技役員","※","引率者名①",null,"糸藤▲▲",null,null,null,null,null,null,"※","区分",null,"校長"]
[]
[null,null,null,"引率者名②",null,null,null,null,null,null,null,null,null,"区分"]
[]
[null,null,null,"引率者名③",null,null,null,null,null,null,null,null,null,"区分"]
[]
[null,null,null,"引率者名④",null,null,null,null,null,null,null,null,null,"区分"]
[]
[null,null,null,"引率者名⑤",null,null,null,null,null,null,null,null,null,"区分"]
[]
[null,null,null,"部活動指導員",null,null,null,null,null,null,null,null,"任命権者"]
[]
[null,null,"※","競技役員名①",null,"井上▲▲",null,null,null,null,null,"※","参加日程",null,null,"両日",null,null,"※","区分","教諭",null,"※","資格","あり"]
[]
[null,null,null,"競技役員名②",null,null,null,null,null,null,null,null,"参加日程",null,null,null,null,null,null,"区分",null,null,null,"資格"]
[]
[null,null,null,"競技役員名③",null,null,null,null,null,null,null,null,"参加日程",null,null,null,null,null,null,"区分",null,null,null,"資格"]
[]
[null,null,null,null,null,null,null,null,null,null,null,"男","女"]
[null,"参加人数","※","参加人数",null,"自由形",null,null,"50m",null,null,null,null,null,"人数を入力してください",null,null,null,null,null,null,null,null,null,null,null,null,null,null,null,null,null,null,null,null,null,null,null,null,null,null,null,null,null,null,null,null,null,null,null,null,null,null,null,null,null,null,null,null,null,null,null,null,null,null,null,null,null,null,null,null,null,null,null,null,"参加日程",null,"区分",null,"審判資格"]
[null,null,null,null,null,null,null,null,"100m",null,null,null,null,null,null,null,null,null,null,null,null,null,null,null,null,null,"自　由　形",null,null,null,null,null,null,null,null,null,null,null,null,null,null,null,null,null,"背泳ぎ",null,null,null,null,null,"平泳ぎ",null,null,null,null,null,"ﾊﾞﾀﾌﾗｲ",null,null,null,null,null,"個人ﾒﾄﾞﾚｰ",null,null,null,null,null,"MR",null,null,"FR",null,null,null,"両日",null,"校長",null,"あり"]
[null,null,null,null,null,null,null,null,"200m",null,null,null,null,null,"※","登録選手数",null,null,null,"男子",1,null,"人",null,null,null,"50m",null,null,"100m",null,null,"200m",null,null,"400m",null,null,"800m",null,null,"1500m",null,null,"100m",null,null,"200m",null,null,"100m",null,null,"200m",null,null,"100m",null,null,"200m",null,null,"200m",null,null,"400m",null,null,"400m",null,null,"400m",null,null,null,"初日のみ",null,"教頭",null,"なし"]
[null,null,null,null,null,null,null,null,{"$f":"IF(I5=\"広島県中学校水泳競技選手権大会（競泳競技）\",\"400m\",\"-\")","v":"-"},null,null,null,null,null,null,null,null,null,null,null,null,null,null,null,null,null,{"$f":"L42","v":0},null,null,{"$f":"L43","v":0},null,null,{"$f":"L44","v":0},null,null,{"$f":"L45","v":0},null,null,null,null,null,{"$f":"L47","v":0},null,null,{"$f":"L48","v":0},null,null,{"$f":"L49","v":0},null,null,{"$f":"L50","v":0},null,null,{"$f":"L51","v":1},null,null,{"$f":"L52","v":0},null,null,{"$f":"L53","v":0},null,null,{"$f":"L54","v":1},null,null,{"$f":"L55","v":0},null,null,{"$f":"L56","v":0},null,null,{"$f":"L57","v":0},null,null,null,"2日目のみ",null,"主幹"]
[null,null,null,null,null,null,null,null,{"$f":"IF(I5=\"広島県中学校水泳競技選手権大会（競泳競技）\",\"800m\",\"-\")","v":"-"},null,null,null,null,null,null,null,null,null,null,"女子",1,null,"人",null,null,null,{"$f":"M42","v":0},null,null,{"$f":"M43","v":0},null,null,{"$f":"M44","v":0},null,null,{"$f":"M45","v":0},null,null,{"$f":"M46","v":0},null,null,null,null,null,{"$f":"M48","v":1},null,null,{"$f":"M49","v":1},null,null,{"$f":"M50","v":0},null,null,{"$f":"M51","v":0},null,null,{"$f":"M52","v":0},null,null,{"$f":"M53","v":0},null,null,{"$f":"M54","v":0},null,null,{"$f":"L55","v":0},null,null,{"$f":"M56","v":0},null,null,{"$f":"M57","v":0},null,null,null,null,null,"教諭"]
[null,null,null,null,null,null,null,null,{"$f":"IF(I5=\"広島県中学校水泳競技選手権大会（競泳競技）\",\"1500m\",\"-\")","v":"-"},null,null,null,null,null,null,null,null,null,null,null,null,null,null,null,null,null,null,null,null,null,null,null,null,null,null,null,null,null,null,null,null,null,null,null,null,null,null,null,null,null,null,null,null,null,null,null,null,null,null,null,null,null,null,null,null,null,null,null,null,null,null,null,null,null,null,null,null,"保護者"]
[null,null,null,null,null,"背泳ぎ",null,null,{"$f":"IF(I5=\"広島県中学校水泳競技選手権大会（競泳競技）\",\"100m\",\"50m\")","v":"50m"},null,null,null,1,null,null,null,null,null,null,null,null,null,null,null,null,null,null,null,null,null,null,null,null,null,null,null,null,null,null,null,null,null,null,null,null,null,null,null,null,null,null,null,null,null,null,null,null,null,null,null,null,null,null,null,null,null,null,null,null,null,null,null,null,null,null,null,null,"その他"]
[null,null,null,null,null,null,null,null,{"$f":"IF(I5=\"広島県中学校水泳競技選手権大会（競泳競技）\",\"200m\",\"100m\")","v":"100m"},null,null,null,1]
[null,null,null,null,null,"平泳ぎ",null,null,{"$f":"IF(I5=\"広島県中学校水泳競技選手権大会（競泳競技）\",\"100m\",\"50m\")","v":"50m"}]
[null,null,null,null,null,null,null,null,{"$f":"IF(I5=\"広島県中学校水泳競技選手権大会（競泳競技）\",\"200m\",\"100m\")","v":"100m"},null,null,1]
[null,null,null,null,null,"ﾊﾞﾀﾌﾗｲ",null,null,{"$f":"IF(I5=\"広島県中学校水泳競技選手権大会（競泳競技）\",\"100m\",\"50m\")","v":"50m"}]
[null,null,null,null,null,null,null,null,{"$f":"IF(I5=\"広島県中学校水泳競技選手権大会（競泳競技）\",\"200m\",\"100m\")","v":"100m"}]
[null,null,null,null,null,"個人ﾒﾄﾞﾚｰ",null,null,"200m",null,null,1,null,null,null,null,null,null,null,null,null,null,null,null,null,null,1]
[null,null,null,null,null,null,null,null,{"$f":"IF(I5=\"広島県中学校水泳競技選手権大会（競泳競技）\",\"400m\",\"-\")","v":"-"}]
[null,null,null,null,null,"MR",null,null,{"$f":"IF(I5=\"広島県中学校水泳競技選手権大会（競泳競技）\",\"400m\",\"200m\")","v":"200m"},null,null,null,null,null,"出場の場合は，１を入力してください。"]
[null,null,null,null,null,"FR",null,null,{"$f":"IF(I5=\"広島県中学校水泳競技選手権大会（競泳競技）\",\"400m\",\"200m\")","v":"200m"}]
[]
[]
[]
[null,"問い合わせ先","※","名前",null,"田中▲▲",null,null,null,null,null,null,null,null,null,null,null,null,null,"区分","教諭"]
[]
[null,null,"※","Tel",null,"123－456－7895"]
[]
[null,null,"※","携帯電話",null,"028－999－9999"]
[]
[]
[]
[]
[]
[]
[]
[]
[]
[]
[]
[]
[]
[]
[]
[]
[]
[]
[]
[]
[]
[]
[]
[]
[]
[]
[null,null,null,null,null,null,"自　由　形",null,null,null,null,null,null,null,null,null,null,null,null,null,null,null,null,null,"背泳ぎ",null,null,null,null,null,"平泳ぎ",null,null,null,null,null,"ﾊﾞﾀﾌﾗｲ",null,null,null,null,null,"個人ﾒﾄﾞﾚｰ",null,null,null,null,null,"MR",null,null,"FR"]
[null,null,null,null,null,null,"50m",null,null,"100m",null,null,"200m",null,null,"400m",null,null,"800m",null,null,"1500m",null,null,"100m",null,null,"200m",null,null,"100m",null,null,"200m",null,null,"100m",null,null,"200m",null,null,"200m",null,null,"400m",null,null,"400m",null,null,"400m"]
[null,null,null,null,null,null,{"$f":"#REF!","v":{"$error":"#REF!"}},null,null,{"$f":"#REF!","v":{"$error":"#REF!"}},null,null,{"$f":"#REF!","v":{"$error":"#REF!"}},null,null,{"$f":"#REF!","v":{"$error":"#REF!"}},null,null,null,null,null,{"$f":"#REF!","v":{"$error":"#REF!"}},null,null,{"$f":"#REF!","v":{"$error":"#REF!"}},null,null,{"$f":"#REF!","v":{"$error":"#REF!"}},null,null,{"$f":"#REF!","v":{"$error":"#REF!"}},null,null,{"$f":"#REF!","v":{"$error":"#REF!"}},null,null,{"$f":"#REF!","v":{"$error":"#REF!"}},null,null,{"$f":"#REF!","v":{"$error":"#REF!"}},null,null,{"$f":"#REF!","v":{"$error":"#REF!"}},null,null,{"$f":"#REF!","v":{"$error":"#REF!"}},null,null,{"$f":"#REF!","v":{"$error":"#REF!"}},null,null,{"$f":"#REF!","v":{"$error":"#REF!"}}]
[null,null,null,null,null,null,{"$f":"#REF!","v":{"$error":"#REF!"}},null,null,{"$f":"#REF!","v":{"$error":"#REF!"}},null,null,{"$f":"#REF!","v":{"$error":"#REF!"}},null,null,{"$f":"#REF!","v":{"$error":"#REF!"}},null,null,{"$f":"#REF!","v":{"$error":"#REF!"}},null,null,null,null,null,{"$f":"#REF!","v":{"$error":"#REF!"}},null,null,{"$f":"#REF!","v":{"$error":"#REF!"}},null,null,{"$f":"#REF!","v":{"$error":"#REF!"}},null,null,{"$f":"#REF!","v":{"$error":"#REF!"}},null,null,{"$f":"#REF!","v":{"$error":"#REF!"}},null,null,{"$f":"#REF!","v":{"$error":"#REF!"}},null,null,{"$f":"#REF!","v":{"$error":"#REF!"}},null,null,{"$f":"#REF!","v":{"$error":"#REF!"}},null,null,{"$f":"#REF!","v":{"$error":"#REF!"}},null,null,{"$f":"#REF!","v":{"$error":"#REF!"}}]
[]
[]
[]
[]
[]
[]
[]
[]
[]
[null,null,null,null,null,null,"広島県中学校水泳競技選手権大会（競泳競技）"]
[null,null,null,null,null,null,"広島県中学校新人水泳競技大会"]
[]
[]
[]
[]
[null,null,null,null,null,null,"参加日程",null,null,null,"区分",null,null,null,"審判資格"]
[null,null,null,null,null,null,"両日",null,null,null,"校長",null,null,null,"あり"]
[null,null,null,null,null,null,"初日のみ",null,null,null,"教頭",null,null,null,"なし"]
[null,null,null,null,null,null,"2日目のみ",null,null,null,"主幹"]
[null,null,null,null,null,null,null,null,null,null,"教諭"]
[null,null,null,null,null,null,null,null,null,null,"保護者"]
[null,null,null,null,null,null,null,null,null,null,"その他"]
[]
[]
[]
[]
[]
[]
[]
[]
[]
[]
[]
[null,null,null,null,null,null,null,null,null,1,2,3,4,5,6,7,8,9,10]
[null,null,null,null,null,null,null,null,null,null,null,null,null,null,null,"県中",null,null,"県新人"]
[null,null,null,null,null,null,"元号1",null,null,"年","年齢",null,"西暦",null,null,"回数",null,null,"回数"]
[null,null,null,null,null,null,"令和",null,null,4,62,null,2022,null,null,62,null,null,2,null,null,null,0]
[null,null,null,null,null,null,"令和",null,null,5,63,null,2023,null,null,63,null,null,3,null,null,null,1]
[null,null,null,null,null,null,"令和",null,null,6,64,null,2024,null,null,64,null,null,4,null,null,null,2]
[null,null,null,null,null,null,"令和",null,null,7,65,null,2025,null,null,65,null,null,5,null,null,null,3]
[null,null,null,null,null,null,"令和",null,null,8,66,null,2026,null,null,66,null,null,6,null,null,null,4]
[null,null,null,null,null,null,"令和",null,null,9,67,null,2027,null,null,67,null,null,7,null,null,null,5]
[null,null,null,null,null,null,"令和",null,null,10,68,null,2028,null,null,68,null,null,8,null,null,null,6]
[null,null,null,null,null,null,"令和",null,null,11,69,null,2029,null,null,69,null,null,9,null,null,null,7]
[null,null,null,null,null,null,"令和",null,null,12,70,null,2030,null,null,70,null,null,10,null,null,null,8]
[null,null,null,null,null,null,"令和",null,null,13,71,null,2031,null,null,71,null,null,11,null,null,null,9]
[null,null,null,null,null,null,"令和",null,null,14,72,null,2032,null,null,72,null,null,12,null,null,null,10]
[null,null,null,null,null,null,"令和",null,null,15,73,null,2033,null,null,73,null,null,13,null,null,null,11]
[null,null,null,null,null,null,"令和",null,null,16,74,null,2034,null,null,74,null,null,14,null,null,null,12]
[null,null,null,null,null,null,"令和",null,null,17,75,null,2035,null,null,75,null,null,15,null,null,null,13]
[null,null,null,null,null,null,"令和",null,null,18,76,null,2036,null,null,76,null,null,16,null,null,null,14]
[null,null,null,null,null,null,"令和",null,null,19,77,null,2037,null,null,77,null,null,17,null,null,null,15]
[null,null,null,null,null,null,"令和",null,null,20,78,null,2038,null,null,78,null,null,18,null,null,null,16]
[null,null,null,null,null,null,"令和",null,null,21,79,null,2039,null,null,79,null,null,19,null,null,null,17]
[null,null,null,null,null,null,"令和",null,null,22,80,null,2040,null,null,80,null,null,20,null,null,null,18]
[null,null,null,null,null,null,"令和",null,null,23,81,null,2041,null,null,81,null,null,21,null,null,null,19]
[null,null,null,null,null,null,"令和",null,null,24,82,null,2042,null,null,82,null,null,22,null,null,null,20]
[null,null,null,null,null,null,"令和",null,null,25,83,null,2043,null,null,83,null,null,23,null,null,null,21]
[null,null,null,null,null,null,"令和",null,null,26,84,null,2044,null,null,84,null,null,24,null,null,null,22]
[null,null,null,null,null,null,"令和",null,null,27,85,null,2045,null,null,85,null,null,25,null,null,null,23]
[null,null,null,null,null,null,"令和",null,null,28,86,null,2046,null,null,86,null,null,26,null,null,null,24]
[null,null,null,null,null,null,"令和",null,null,29,87,null,2047,null,null,87,null,null,27,null,null,null,25]
[null,null,null,null,null,null,"令和",null,null,30,88,null,2048,null,null,88,null,null,28,null,null,null,26]
[null,null,null,null,null,null,"令和",null,null,31,89,null,2049,null,null,89,null,null,29,null,null,null,27]
[null,null,null,null,null,null,"令和",null,null,32,90,null,2050,null,null,90,null,null,30,null,null,null,28]
[null,null,null,null,null,null,"令和",null,null,33,91,null,2051,null,null,91,null,null,31,null,null,null,29]
[null,null,null,null,null,null,null,null,null,null,null,null,null,null,null,null,null,null,null,null,null,null,30]
[null,null,null,null,null,null,null,null,null,null,null,null,null,null,null,null,null,null,null,null,null,null,31]
[null,null,null,null,null,null,null,null,null,null,null,null,null,null,null,null,null,null,null,null,null,null,32]
[null,null,null,null,null,null,null,null,null,null,null,null,null,null,null,null,null,null,null,null,null,null,33]
[null,null,null,null,null,null,null,null,null,null,null,null,null,null,null,null,null,null,null,null,null,null,34]
[null,null,null,null,null,null,null,null,null,null,null,null,null,null,null,null,null,null,null,null,null,null,35]
[null,null,null,null,null,null,null,null,null,null,null,null,null,null,null,null,null,null,null,null,null,null,36]
[null,null,null,null,null,null,null,null,null,null,null,null,null,null,null,null,null,null,null,null,null,null,37]
[null,null,null,null,null,null,null,null,null,null,null,null,null,null,null,null,null,null,null,null,null,null,38]
[null,null,null,null,null,null,null,null,null,null,null,null,null,null,null,null,null,null,null,null,null,null,39]
[null,null,null,null,null,null,null,null,null,null,null,null,null,null,null,null,null,null,null,null,null,null,40]
[null,null,null,null,null,null,null,null,null,null,null,null,null,null,null,null,null,null,null,null,null,null,41]
[null,null,null,null,null,null,null,null,null,null,null,null,null,null,null,null,null,null,null,null,null,null,42]
[null,null,null,null,null,null,null,null,null,null,null,null,null,null,null,null,null,null,null,null,null,null,43]
[null,null,null,null,null,null,null,null,null,null,null,null,null,null,null,null,null,null,null,null,null,null,44]
[null,null,null,null,null,null,null,null,null,null,null,null,null,null,null,null,null,null,null,null,null,null,45]
[null,null,null,null,null,null,null,null,null,null,null,null,null,null,null,null,null,null,null,null,null,null,46]
[null,null,null,null,null,null,null,null,null,null,null,null,null,null,null,null,null,null,null,null,null,null,47]
[null,null,null,null,null,null,null,null,null,null,null,null,null,null,null,null,null,null,null,null,null,null,48]
[null,null,null,null,null,null,null,null,null,null,null,null,null,null,null,null,null,null,null,null,null,null,49]
[null,null,null,null,null,null,null,null,null,null,null,null,null,null,null,null,null,null,null,null,null,null,50]

{"sheet":"R4～様式K","index":6,"n_rows":52,"n_cols":55,"rows_kept":52,"cut":false,"hidden":true,"merged":[[29,14,30,19],[1,1,1,2],[2,46,2,47],[2,52,2,53],[10,7,11,21],[11,37,13,40],[11,41,13,43],[11,44,13,46],[11,47,13,49],[11,50,13,52],[21,39,21,42],[21,29,21,38],[24,39,24,42],[12,7,13,21],[14,9,15,11],[14,13,15,17],[23,3,24,12],[25,3,26,12],[27,3,28,12],[21,2,21,12],[21,13,21,27],[23,14,24,19],[25,14,26,19],[27,14,28,19],[38,39,38,44],[34,17,34,25],[32,31,35,56],[33,3,34,12],[34,13,34,16],[38,45,38,50],[38,51,38,53],[38,54,38,56],[39,51,39,53],[39,54,39,56],[40,27,40,29],[40,30,40,32],[39,24,39,26],[39,27,39,29],[39,30,39,32],[38,2,38,8],[38,9,38,26],[38,27,38,32],[38,33,38,38],[39,2,39,8],[39,9,39,11],[39,12,39,14],[39,15,39,17],[39,18,39,20],[39,21,39,23],[40,2,40,8],[40,9,40,11],[40,12,40,14],[40,15,40,17],[40,18,40,20],[40,21,40,23],[40,54,40,56],[41,2,41,8],[41,9,41,11],[41,12,41,14],[41,15,41,17],[41,18,41,20],[41,45,41,47],[41,48,41,50],[41,51,41,53],[41,54,41,56],[41,21,41,23],[41,24,41,26],[41,27,41,29],[41,30,41,32],[41,33,41,35],[41,36,41,38],[40,33,40,35],[40,36,40,38],[40,39,40,41],[40,42,40,44],[40,45,40,47],[40,48,40,50],[40,51,40,53],[40,24,40,26],[47,5,47,19],[47,26,47,41],[44,6,45,18],[44,20,45,27],[41,39,41,41],[41,42,41,44],[6,4,6,5],[31,14,32,19],[6,6,6,8],[6,11,6,31],[24,43,24,52],[25,43,25,52],[26,43,26,52],[27,43,27,52],[28,43,28,52],[29,43,29,52],[30,43,30,52],[31,43,31,52],[39,33,39,35],[39,36,39,38],[39,39,39,41],[39,42,39,44],[39,45,39,47],[39,48,39,50],[2,49,2,50],[14,23,15,53],[17,14,17,28],[17,35,17,50],[29,3,30,12],[31,3,32,12],[29,60,29,63],[30,60,30,63],[31,60,31,63],[23,29,25,38],[26,29,28,38],[29,29,31,38],[23,39,23,42],[26,60,26,63],[27,60,27,63],[28,60,28,63],[25,39,25,42],[26,39,26,42],[27,39,27,42],[28,39,28,42],[29,39,29,42],[30,39,30,42],[31,39,31,42],[23,43,23,52]]}
[]
[null,"様式K",null,null,"（出場校　→　郡市委員長）",null,null,null,null,null,null,null,null,null,null,null,null,null,null,null,"大会参加申込書"]
[null,null,null,null,null,null,null,null,null,null,null,null,null,null,null,null,null,null,null,null,null,null,null,null,null,null,null,null,null,null,null,null,null,null,null,null,null,null,null,null,null,null,null,null,"令和",null,{"$f":"IF(県大会入力シート!H3=\"\",\"\",県大会入力シート!H3)","v":4},null,"年",{"$f":"IF(県大会入力シート!J3=\"\",\"\",県大会入力シート!J3)","v":8},null,"月",{"$f":"IF(県大会入力シート!L3=\"\",\"\",県大会入力シート!L3)","v":2},null,"日"]
[null,"広島県中学校体育連盟会長 様"]
[]
[]
[null,"　下記の通り，",null,null,"第",null,{"$f":"IF(県大会入力シート!G5=\"\",\"\",県大会入力シート!G5)","v":2},null,null,"回",null,{"$f":"IF(県大会入力シート!I5=\"\",\"\",県大会入力シート!I5)","v":"広島県中学校新人水泳競技大会"},null,null,null,null,null,null,null,null,null,null,null,null,null,null,null,null,null,null,null,null,null,"に別添一覧の選手が出場することを認め，参加申し込みを致します。"]
[]
[]
[null,null,"■出場校"]
[null,null,null,null,null,null,null,{"$f":"IF(県大会入力シート!F8=\"\",\"\",県大会入力シート!F8)","v":"広島市立己斐中学校"}]
[null,null,null,"中学校名",null,null,null,null,null,null,null,null,null,null,null,null,null,null,null,null,null,null,null,null,null,null,null,null,null,null,null,null,null,null,null,null,null,3,null,null,null,4,null,null,{"$f":"IF(県大会入力シート!H10=\"\",\"\",県大会入力シート!H10)","v":"A"},null,null,{"$f":"IF(県大会入力シート!I10=\"\",\"\",県大会入力シート!I10)","v":"3"},null,null,{"$f":"IF(県大会入力シート!J10=\"\",\"\",県大会入力シート!J10)","v":"0"}]
[null,null,null,null,null,null,null,{"$f":"IF(県大会入力シート!F12=\"\",\"\",県大会入力シート!F12)","v":"溝下　明美"},null,null,null,null,null,null,null,null,null,null,null,null,null,null,null,null,null,null,null,null,null,null,null,null,"団体登録番号"]
[null,null,null,"校長名",null,null,null,null,null,null,null,null,null,null,null,null,null,null,null,null,null,null,null,null,null,"印"]
[null,null,null,null,null,null,null,null,null,{"$f":"IF(県大会入力シート!G14=\"\",\"\",県大会入力シート!G14)","v":"733"},null,null,null,{"$f":"IF(県大会入力シート!J14=\"\",\"\",県大会入力シート!J14)","v":"0815"},null,null,null,null,null,null,null,null,null,{"$f":"\"広島県 \"&IF(県大会入力シート!I16=\"\",\"\",県大会入力シート!I16)","v":"広島県 広島市西区己斐上3-35-1"}]
[null,null,null,"所在地",null,null,null,"〒",null,null,null,null,"－"]
[]
[null,null,null,null,null,null,null,null,null,null,null,null,"TEL",null,{"$f":"IF(県大会入力シート!F18=\"\",\"\",県大会入力シート!F18)","v":"082-271-2260"},null,null,null,null,null,null,null,null,null,null,null,null,null,null,null,null,null,null,"FAX",null,{"$f":"IF(県大会入力シート!F20=\"\",\"\",県大会入力シート!F20)","v":"082-271-5499"}]
[]
[]
[null,null,"■引率者",null,null,null,null,null,null,null,null,null,null,null,null,null,null,null,null,null,null,null,null,null,null,null,null,null,null,"■競技役員"]
[null,null,"引　率　者　名",null,null,null,null,null,null,null,null,null,null,"区　　　　分",null,null,null,null,null,null,null,null,null,null,null,null,null,null,null,"競　技　役　員　名"]
[]
[null,null,null,{"$f":"IF(県大会入力シート!F23=\"\",\"\",県大会入力シート!F23)","v":"糸藤▲▲"},null,null,null,null,null,null,null,null,null,null,{"$f":"IF(県大会入力シート!P23=\"\",\"\",県大会入力シート!P23)","v":"校長"},null,null,null,null,null,null,null,null,null,null,null,null,null,null,{"$f":"IF(県大会入力シート!F35=\"\",\"\",県大会入力シート!F35)","v":"井上▲▲"},null,null,null,null,null,null,null,null,null,"① 参加日程",null,null,null,{"$f":"IF(県大会入力シート!P35=\"\",\"\",県大会入力シート!P35)","v":"両日"}]
[null,null,null,null,null,null,null,null,null,null,null,null,null,null,null,null,null,null,null,null,null,null,null,null,null,null,null,null,null,null,null,null,null,null,null,null,null,null,null,"② 区分",null,null,null,{"$f":"IF(県大会入力シート!U35=\"\",\"\",県大会入力シート!U35)","v":"教諭"}]
[null,null,null,{"$f":"IF(県大会入力シート!F25=\"\",\"\",県大会入力シート!F25)","v":""},null,null,null,null,null,null,null,null,null,null,{"$f":"IF(県大会入力シート!P25=\"\",\"\",県大会入力シート!P25)","v":""},null,null,null,null,null,null,null,null,null,null,null,null,null,null,null,null,null,null,null,null,null,null,null,null,"③ 審判資格",null,null,null,{"$f":"IF(県大会入力シート!Y35=\"\",\"\",県大会入力シート!Y35)","v":"あり"}]
[null,null,null,null,null,null,null,null,null,null,null,null,null,null,null,null,null,null,null,null,null,null,null,null,null,null,null,null,null,{"$f":"IF(県大会入力シート!F37=\"\",\"\",県大会入力シート!F37)","v":""},null,null,null,null,null,null,null,null,null,"① 参加日程",null,null,null,{"$f":"IF(県大会入力シート!P37=\"\",\"\",県大会入力シート!P37)","v":""}]
[null,null,null,{"$f":"IF(県大会入力シート!F27=\"\",\"\",県大会入力シート!F27)","v":""},null,null,null,null,null,null,null,null,null,null,{"$f":"IF(県大会入力シート!P27=\"\",\"\",県大会入力シート!P27)","v":""},null,null,null,null,null,null,null,null,null,null,null,null,null,null,null,null,null,null,null,null,null,null,null,null,"② 区分",null,null,null,{"$f":"IF(県大会入力シート!U37=\"\",\"\",県大会入力シート!U37)","v":""}]
[null,null,null,null,null,null,null,null,null,null,null,null,null,null,null,null,null,null,null,null,null,null,null,null,null,null,null,null,null,null,null,null,null,null,null,null,null,null,null,"③ 審判資格",null,null,null,{"$f":"IF(県大会入力シート!Y37=\"\",\"\",県大会入力シート!Y37)","v":""}]
[null,null,null,{"$f":"IF(県大会入力シート!F29=\"\",\"\",県大会入力シート!F29)","v":""},null,null,null,null,null,null,null,null,null,null,{"$f":"IF(県大会入力シート!P29=\"\",\"\",県大会入力シート!P29)","v":""},null,null,null,null,null,null,null,null,null,null,null,null,null,null,{"$f":"IF(県大会入力シート!F39=\"\",\"\",県大会入力シート!F39)","v":""},null,null,null,null,null,null,null,null,null,"① 参加日程",null,null,null,{"$f":"IF(県大会入力シート!P39=\"\",\"\",県大会入力シート!P39)","v":""}]
[null,null,null,null,null,null,null,null,null,null,null,null,null,null,null,null,null,null,null,null,null,null,null,null,null,null,null,null,null,null,null,null,null,null,null,null,null,null,null,"② 区分",null,null,null,{"$f":"IF(県大会入力シート!U39=\"\",\"\",県大会入力シート!U39)","v":""}]
[null,null,null,{"$f":"IF(県大会入力シート!F31=\"\",\"\",県大会入力シート!F31)","v":""},null,null,null,null,null,null,null,null,null,null,{"$f":"IF(県大会入力シート!P31=\"\",\"\",県大会入力シート!P31)","v":""},null,null,null,null,null,null,null,null,null,null,null,null,null,null,null,null,null,null,null,null,null,null,null,null,"③ 審判資格",null,null,null,{"$f":"IF(県大会入力シート!Y39=\"\",\"\",県大会入力シート!Y39)","v":""}]
[null,null,null,null,null,null,null,null,null,null,null,null,null,null,null,null,null,null,null,null,null,null,null,null,null,null,null,null,null,null,null,"※　①②③のそれぞれの確認事項の入力を忘れないようにお願いします。\n※　特例引率での大会参加の場合，競技役員は１日１名の記入お願いします。\n※　参加日程/区分の入力を忘れないようにお願いします。"]
[null,null,null,{"$f":"IF(県大会入力シート!F33=\"\",\"\",県大会入力シート!F33)","v":""}]
[null,null,null,null,null,null,null,null,null,null,null,null,null,"　（　任命権者：",null,null,null,{"$f":"IF(県大会入力シート!P33=\"\",\"\",県大会入力シート!P33)","v":""},null,null,null,null,null,null,null,null,")"]
[]
[]
[null,null,"■参加人数"]
[null,null,"種　目",null,null,null,null,null,null,"自　由　形",null,null,null,null,null,null,null,null,null,null,null,null,null,null,null,null,null,"背泳ぎ",null,null,null,null,null,"平泳ぎ",null,null,null,null,null,"ﾊﾞﾀﾌﾗｲ",null,null,null,null,null,"個人ﾒﾄﾞﾚｰ",null,null,null,null,null,"MR",null,null,"FR"]
[null,null,"距　離",null,null,null,null,null,null,"50m",null,null,"100m",null,null,"200m",null,null,{"$f":"IF($L$7=\"広島県中学校水泳競技選手権大会（競泳競技）\",\"400m\",\"**\")","v":"**"},null,null,{"$f":"IF($L$7=\"広島県中学校水泳競技選手権大会（競泳競技）\",\"800m\",\"**\")","v":"**"},null,null,{"$f":"IF($L$7=\"広島県中学校水泳競技選手権大会（競泳競技）\",\"1500m\",\"**\")","v":"**"},null,null,{"$f":"IF($L$7=\"広島県中学校水泳競技選手権大会（競泳競技）\",\"100m\",\"50m\")","v":"50m"},null,null,{"$f":"IF($L$7=\"広島県中学校水泳競技選手権大会（競泳競技）\",\"200m\",\"100m\")","v":"100m"},null,null,{"$f":"IF($L$7=\"広島県中学校水泳競技選手権大会（競泳競技）\",\"100m\",\"50m\")","v":"50m"},null,null,{"$f":"IF($L$7=\"広島県中学校水泳競技選手権大会（競泳競技）\",\"200m\",\"100m\")","v":"100m"},null,null,{"$f":"IF($L$7=\"広島県中学校水泳競技選手権大会（競泳競技）\",\"100m\",\"50m\")","v":"50m"},null,null,{"$f":"IF($L$7=\"広島県中学校水泳競技選手権大会（競泳競技）\",\"200m\",\"100m\")","v":"100m"},null,null,"200m",null,null,{"$f":"IF($L$7=\"広島県中学校水泳競技選手権大会（競泳競技）\",\"400m\",\"**\")","v":"**"},null,null,{"$f":"IF($L$7=\"広島県中学校水泳競技選手権大会（競泳競技）\",\"400m\",\"200m\")","v":"200m"},null,null,{"$f":"IF($L$7=\"広島県中学校水泳競技選手権大会（競泳競技）\",\"400m\",\"200m\")","v":"200m"}]
[null,null,"男　子",null,null,null,null,null,null,{"$f":"IF(県大会入力シート!AA45=\"\",\"\",県大会入力シート!AA45)","v":0},null,null,{"$f":"IF(県大会入力シート!AD45=\"\",\"\",県大会入力シート!AD45)","v":0},null,null,{"$f":"IF(県大会入力シート!AG45=\"\",\"\",県大会入力シート!AG45)","v":0},null,null,{"$f":"IF(県大会入力シート!AJ45=\"\",\"\",県大会入力シート!AJ45)","v":0},null,null,"-",null,null,{"$f":"IF(県大会入力シート!AP45=\"\",\"\",県大会入力シート!AP45)","v":0},null,null,{"$f":"IF(県大会入力シート!AS45=\"\",\"\",県大会入力シート!AS45)","v":0},null,null,{"$f":"IF(県大会入力シート!AV45=\"\",\"\",県大会入力シート!AV45)","v":0},null,null,{"$f":"IF(県大会入力シート!AY45=\"\",\"\",県大会入力シート!AY45)","v":0},null,null,{"$f":"IF(県大会入力シート!BB45=\"\",\"\",県大会入力シート!BB45)","v":1},null,null,{"$f":"IF(県大会入力シート!BE45=\"\",\"\",県大会入力シート!BE45)","v":0},null,null,{"$f":"IF(県大会入力シート!BH45=\"\",\"\",県大会入力シート!BH45)","v":0},null,null,{"$f":"IF(県大会入力シート!BK45=\"\",\"\",県大会入力シート!BK45)","v":1},null,null,{"$f":"IF(県大会入力シート!BN45=\"\",\"\",県大会入力シート!BN45)","v":0},null,null,{"$f":"IF(県大会入力シート!BQ45=1,\"○\",\"\")","v":""},null,null,{"$f":"IF(県大会入力シート!BT45=1,\"○\",\"\")","v":""}]
[null,null,"女　子",null,null,null,null,null,null,{"$f":"IF(県大会入力シート!AA46=\"\",\"\",県大会入力シート!AA46)","v":0},null,null,{"$f":"IF(県大会入力シート!AD46=\"\",\"\",県大会入力シート!AD46)","v":0},null,null,{"$f":"IF(県大会入力シート!AG46=\"\",\"\",県大会入力シート!AG46)","v":0},null,null,{"$f":"IF(県大会入力シート!AJ46=\"\",\"\",県大会入力シート!AJ46)","v":0},null,null,{"$f":"IF(県大会入力シート!AM46=\"\",\"\",県大会入力シート!AM46)","v":0},null,null,"-",null,null,{"$f":"IF(県大会入力シート!AS46=\"\",\"\",県大会入力シート!AS46)","v":1},null,null,{"$f":"IF(県大会入力シート!AV46=\"\",\"\",県大会入力シート!AV46)","v":1},null,null,{"$f":"IF(県大会入力シート!AY46=\"\",\"\",県大会入力シート!AY46)","v":0},null,null,{"$f":"IF(県大会入力シート!BB46=\"\",\"\",県大会入力シート!BB46)","v":0},null,null,{"$f":"IF(県大会入力シート!BE46=\"\",\"\",県大会入力シート!BE46)","v":0},null,null,{"$f":"IF(県大会入力シート!BH46=\"\",\"\",県大会入力シート!BH46)","v":0},null,null,{"$f":"IF(県大会入力シート!BK46=\"\",\"\",県大会入力シート!BK46)","v":0},null,null,{"$f":"IF(県大会入力シート!BN46=\"\",\"\",県大会入力シート!BN46)","v":0},null,null,{"$f":"IF(県大会入力シート!BQ46=1,\"○\",\"\")","v":""},null,null,{"$f":"IF(県大会入力シート!BT46=1,\"○\",\"\")","v":""}]
[]
[null,null,"■申し込み責任者　問い合わせ先",null,null,null,null,null,null,null,null,null,null,null,null,null,null,null,null,null,null,null,null,null,null,null,null,null,null,null,null,null,null,null,null,null,null,null,null,null,null,null,null,"※ﾘﾚｰ種目については，出場の場合に○印を記入してください。"]
[null,null,null,null,null,null,{"$f":"IF(県大会入力シート!F61=\"\",\"\",県大会入力シート!F61)","v":"田中▲▲"},null,null,null,null,null,null,null,null,null,null,null,null,null,{"$f":"IF(県大会入力シート!U61=\"\",\"\",県大会入力シート!U61)","v":"教諭"}]
[null,null,null,"お名前"]
[]
[null,null,null,"TEL",null,{"$f":"IF(県大会入力シート!F63=\"\",\"\",県大会入力シート!F63)","v":"123－456－7895"},null,null,null,null,null,null,null,null,null,null,null,null,null,null,null,null,"携帯電話",null,null,null,{"$f":"IF(県大会入力シート!F65=\"\",\"\",県大会入力シート!F65)","v":"028－999－9999"}]
[]
[]
[null,null,"※ 参加申し込みにあたり，各中学校の担当者が，Web上での選手登録・年度更新・ｴﾝﾄﾘｰ等の入力を終えていること。",null,null,null,null,null,null,null,null,null,null,null,null,null,null,null,null,null,null,null,null,null,null,null,null,null,null,null,null,"※ 別添一覧の選手は，Webｴﾝﾄﾘｰされており，この一覧は，Web-SWMSYSからﾌﾟﾘﾝﾄｱｳﾄされたものであること。"]
[null,null,"※ 標記大会の申込にあたり，大会ﾌﾟﾛｸﾞﾗﾑ等及び報道発表（新聞・Webﾍﾟｰｼﾞ等）における選手名，学年，所属等の個人情報の記載について，本人・保護者の同意を得ていること。",null,null,null,null,null,null,null,null,null,null,null,null,null,null,null,null,null,null,null,null,null,null,null,null,null,null,null,null,null,null,null,null,null,null,null,null,null,null,null,null,null,null,null,null,null,"https://swim34.jp/"]

{"sheet":"県大会負担金納入書","index":7,"n_rows":56,"n_cols":15,"rows_kept":56,"cut":false,"hidden":true,"merged":[[41,7,41,9],[34,6,34,13],[35,6,35,13],[30,4,30,13],[17,9,17,13],[19,9,19,13],[21,9,21,13],[23,9,23,13],[25,9,25,13]]}
[]
[]
[]
[]
[]
[]
[]
[null,null,"大会負担金納入書（様式1）　各学校提出用"]
[]
[]
[null,null,null,null,null,null,null,null,null,null,null,null,{"$f":"県大会入力シート!F3&\" \"&県大会入力シート!H3&\" 年 \"&県大会入力シート!J3&\" 月 \"&県大会入力シート!L3&\" 日\"","v":"令和 4 年 8 月 2 日"}]
[]
[]
[null,null,"広島県中学校体育連盟会長 様"]
[]
[]
[]
[null,null,null,null,null,null,null,"学校名",null,{"$f":"県大会入力シート!F8","v":"広島市立己斐中学校"}]
[]
[null,null,null,null,null,null,null,"住所",null,{"$f":"県大会入力シート!I16","v":"広島市西区己斐上3-35-1"}]
[]
[null,null,null,null,null,null,null,"電話番号",null,{"$f":"県大会入力シート!F18","v":"082-271-2260"}]
[]
[null,null,null,null,null,null,null,"学校長",null,{"$f":"県大会入力シート!F12","v":"溝下　明美"},null,null,null,null,"印"]
[]
[null,null,null,null,null,null,null,"記載者",null,{"$f":"県大会入力シート!F61","v":"田中▲▲"},null,null,null,null,"印"]
[]
[]
[]
[]
[null,null,null,null,"大会負担金納入書"]
[]
[]
[null,null,null,null,"　　次の大会へ本校生徒が参加しますので，大会負担金を納入します。"]
[null,null,null,null,"大会名",null,{"$f":"\"第 \"&県大会入力シート!G5&\" 回  \"&県大会入力シート!I5","v":"第 2 回  広島県中学校新人水泳競技大会"}]
[null,null,null,null,"競技種目",null,"水泳競技"]
[null,null,null,null,"登録選手数",null,"男子",{"$f":"県大会入力シート!U44","v":1},null,"女子",{"$f":"県大会入力シート!U46","v":1},"合計",{"$f":"H37+K37","v":2},{"$f":"H37+K37","v":2}]
[]
[]
[null,null,null,null,null,null,1200,"円　×",null,{"$f":"N37","v":2},"名分"]
[null,null,null,null,"大会負担金"]
[null,null,null,null,null,null,null,{"$f":"G40*J40","v":2400},null,null,"円"]
[]
[]
[]
[null,null,null,null,"　※　スコアラー・マネージャー等が生徒の場合は登録選手に含む。"]
[null,null,null,null,"　※　メンバー表のコピーを裏面に添付すること。"]
[null,null,null,null,"　※　原則として大会負担金の返金は行わない。但し，大会が全く実施できなかった場合に"]
[null,null,null,null,"　　　　のみ，必要経費を除いた後に返金する。（全額にならない場合がある）"]
[]
[]
[]
[]
[]
[]
[null,null,null,null,null,null,null,null,null,null,null,"https://swim34.jp/",null,null,{"$f":"VLOOKUP(J18,学校一覧,2,FALSE)","v":"34A30"}]

{"sheet":"県特例申請書","index":8,"n_rows":56,"n_cols":16,"rows_kept":56,"cut":false,"hidden":true,"merged":[[26,10,26,14],[9,5,9,13],[18,10,18,14],[20,10,20,14],[22,10,22,14],[24,10,24,14],[42,7,42,14],[43,7,43,14],[46,9,46,14],[55,13,55,15],[32,5,32,14],[36,7,36,14],[37,7,37,14],[38,7,38,14],[41,7,41,14],[39,7,39,14],[40,7,40,14]]}
[1]
[]
[]
[]
[]
[]
[]
[null,null,null,"大会引率者の特例申請書統一書式"]
[]
[null,null,null,null,null,"大会引率者の特例申請書"]
[]
[]
[null,null,null,null,null,null,null,null,null,null,null,null,{"$f":"県大会入力シート!F3&\" \"&県大会入力シート!H3&\" 年 \"&県大会入力シート!J3&\" 月 \"&県大会入力シート!L3&\" 日\"","v":"令和 4 年 8 月 2 日"}]
[]
[null,null,null,"　広島県中学校体育連盟会長 様"]
[]
[]
[]
[null,null,null,null,null,null,null,null,"学校名",null,{"$f":"市大会入力シート!F8","v":"広島市立己斐中学校"}]
[]
[null,null,null,null,null,null,null,null,"校長名",null,{"$f":"市大会入力シート!F12","v":"溝下　明美"},null,null,null,null,"印"]
[]
[null,null,null,null,null,null,null,null,"住所",null,{"$f":"市大会入力シート!I16","v":"広島市西区己斐上3-35-1"}]
[]
[null,null,null,null,null,null,null,null,"TEL",null,{"$f":"市大会入力シート!F18","v":"082-271-2260"}]
[]
[null,null,null,null,null,null,null,null,"FAX",null,{"$f":"市大会入力シート!F20","v":"082-271-5499"}]
[]
[]
[]
[]
[]
[null,null,null,null,null,"次の者を下記大会への本校引率者として申請します。"]
[]
[]
[]
[null,null,null,null,null,"参加大会名",null,{"$f":"県大会入力シート!F5&県大会入力シート!G5&県大会入力シート!H5&\"　\"&県大会入力シート!I5","v":"第2回　　広島県中学校新人水泳競技大会"}]
[null,null,null,null,null,"参加競技名",null,"水泳競技"]
[null,null,null,null,null,"出場種目名",null,{"$f":"VLOOKUP(A1,特例引率選手名簿,5,FALSE)&\" \"&VLOOKUP(A1,特例引率選手名簿,6,FALSE)&\"   \"&VLOOKUP(A1,特例引率選手名簿,7,FALSE)","v":"    "}]
[null,null,null,null,null,"引率選手名",null,{"$f":"VLOOKUP(A1,特例引率選手名簿,4,FALSE)","v":"yuda"}]
[null,null,null,null,null,"引率者名",null,{"$f":"VLOOKUP(A1,特例引率選手名簿,8,FALSE)","v":0}]
[null,null,null,null,null,"引率者の分類",null,{"$f":"VLOOKUP(A1,特例引率選手名簿,9,FALSE)","v":0}]
[null,null,null,null,null,"引率者住所",null,{"$f":"VLOOKUP(A1,特例引率選手名簿,10,FALSE)","v":0}]
[null,null,null,null,null,"引率者連絡方法",null,{"$f":"VLOOKUP(A1,特例引率選手名簿,11,FALSE)","v":0}]
[null,null,null,null,null,"選手任意保険加入状況",null,null,null,null,null,{"$f":"VLOOKUP(A1,特例引率選手名簿,12,FALSE)","v":0}]
[null,null,null,null,null,"引率者任意保険加入状況",null,null,null,null,null,{"$f":"VLOOKUP(A1,特例引率選手名簿,13,FALSE)","v":0}]
[]
[null,null,null,null,null,null,"※参加申込書とともに各競技の申込先へ提出すること。"]
[]
[]
[]
[]
[]
[]
[]
[null,null,null,null,null,null,null,null,null,null,null,"https://swim34.jp/",null,{"$f":"VLOOKUP(K19,学校一覧,2,FALSE)","v":"34A30"}]

{"sheet":"市大会入力シート","index":9,"n_rows":182,"n_cols":80,"rows_kept":182,"cut":false,"hidden":true,"merged":[[19,5,19,16],[22,1,38,1],[22,5,22,10],[24,5,24,10],[26,5,26,10],[28,5,28,10],[2,1,19,1],[2,5,2,6],[4,8,4,19],[7,5,7,17],[11,5,11,17],[13,6,13,7],[13,9,13,12],[15,5,15,7],[15,8,15,24],[17,5,17,16],[36,5,36,10],[36,15,36,17],[38,5,38,10],[38,15,38,17],[30,5,30,10],[32,5,32,10],[34,5,34,10],[34,15,34,17],[30,15,30,21],[32,15,32,17],[42,50,42,55],[42,56,42,61],[42,62,42,67],[42,68,42,70],[42,71,42,73],[43,8,43,10],[43,20,43,21],[43,26,43,28],[43,29,43,31],[43,32,43,34],[42,8,42,10],[42,26,42,43],[42,44,42,49],[43,35,43,37],[43,38,43,40],[43,41,43,43],[43,44,43,46],[43,65,43,67],[43,68,43,70],[43,71,43,73],[43,53,43,55],[43,56,43,58],[44,8,44,10],[44,26,44,28],[44,29,44,31],[44,32,44,34],[44,35,44,37],[44,38,44,40],[44,41,44,43],[43,47,43,49],[43,50,43,52],[43,59,43,61],[43,62,43,64],[44,62,44,64],[44,65,44,67],[44,68,44,70],[44,71,44,73],[45,8,45,10],[45,20,45,21],[45,26,45,28],[45,29,45,31],[45,32,45,34],[45,35,45,37],[44,44,44,46],[44,47,44,49],[44,50,44,52],[44,53,44,55],[44,56,44,58],[44,59,44,61],[45,56,45,58],[45,59,45,61],[45,62,45,64],[45,65,45,67],[45,68,45,70],[45,71,45,73],[45,38,45,40],[45,41,45,43],[45,44,45,46],[45,47,45,49],[45,50,45,52],[45,53,45,55],[60,1,64,1],[60,5,60,17],[51,5,52,7],[51,8,51,10],[52,8,52,10],[53,5,54,7],[53,8,53,10],[54,8,54,10],[46,8,46,10],[47,5,48,7],[47,8,47,10],[48,8,48,10],[49,5,50,7],[49,8,49,10],[50,8,50,10],[41,1,56,1],[41,5,46,7],[41,8,41,10],[62,5,62,15],[64,5,64,15],[91,6,91,23],[91,24,91,29],[91,30,91,35],[55,5,55,7],[55,8,55,10],[56,5,56,7],[56,8,56,10],[91,36,91,41],[91,42,91,47],[91,48,91,50],[91,51,91,53],[92,6,92,8],[92,9,92,11],[92,12,92,14],[92,15,92,17],[92,18,92,20],[92,21,92,23],[92,45,92,47],[92,48,92,50],[92,51,92,53],[92,33,92,35],[92,36,92,38],[92,39,92,41],[93,6,93,8],[93,9,93,11],[93,12,93,14],[93,15,93,17],[93,18,93,20],[93,21,93,23],[92,24,92,26],[92,27,92,29],[92,30,92,32],[94,18,94,20],[94,21,94,23],[93,24,93,26],[93,27,93,29],[93,30,93,32],[93,33,93,35],[93,36,93,38],[93,39,93,41],[92,42,92,44],[0,1,0,3],[22,15,22,18],[94,42,94,44],[94,45,94,47],[94,48,94,50],[94,51,94,53],[4,5,4,7],[26,15,26,21],[24,15,24,21],[28,15,28,21],[94,24,94,26],[94,27,94,29],[94,30,94,32],[94,33,94,35],[94,36,94,38],[94,39,94,41],[93,42,93,44],[93,45,93,47],[93,48,93,50],[93,51,93,53],[94,6,94,8],[94,9,94,11],[94,12,94,14],[94,15,94,17]]}
[null,"市大会",null,null,null,"※：入力必須項目"]
[]
[null,"学　校　情　報","※","日にち(作成日)",null,"令和",null,4,"年",6,"月",27,"日"]
[]
[null,null,"※","大会名",null,{"$f":"IF(I5=\"広島市中学校水泳競技選手権大会\",\"令和\"&VLOOKUP(H3,J132:S161,1,)&\"年度\",IF(I5=\"広島市中学校新人水泳競技大会\",\"令和\"&VLOOKUP(H3,J132:S161,1,)&\"年度\",\"第\"&VLOOKUP(H3,J132:S161,6,)&\"回\"))","v":"第70回"},null,null,"広島市中学校総合体育大会 水泳競技の部"]
[]
[]
[null,null,"※","中学校名",null,{"$f":"start!G8","v":"広島市立己斐中学校"}]
[]
[null,null,"※","団体登録番号",null,3,4,{"$f":"MID(VLOOKUP(F8,学校一覧,2,FALSE),3,1)","v":"A"},{"$f":"MID(VLOOKUP(F8,学校一覧,2,FALSE),4,1)","v":"3"},{"$f":"MID(VLOOKUP(F8,学校一覧,2,FALSE),5,1)","v":"0"}]
[]
[null,null,"※","校長名",null,{"$f":"start!G10","v":"溝下　明美"}]
[]
[null,null,"※","所在地",null,"〒",{"$f":"MID(VLOOKUP(F8,学校一覧,3,FALSE),1,3)","v":"733"},null,"-",{"$f":"MID(VLOOKUP(F8,学校一覧,3,FALSE),5,8)","v":"0815"},null,{"$f":"MID(VLOOKUP(K8,学校一覧,3),1,3)","v":{"$error":"#N/A"}}]
[]
[null,null,"※",null,null,"広島県",null,null,{"$f":"VLOOKUP(F8,学校一覧,4,FALSE)","v":"広島市西区己斐上3-35-1"}]
[]
[null,null,"※","Tel",null,{"$f":"VLOOKUP(F8,学校一覧,5,FALSE)","v":"082-271-2260"}]
[]
[null,null,"※","FAX",null,{"$f":"VLOOKUP(F8,学校一覧,6,FALSE)","v":"082-271-5499"}]
[]
[]
[null,"引率者・競技役員","※","学校引率者名",null,null,null,null,null,null,null,null,"※","区分"]
[]
[null,null,null,"特例引率者①",null,null,null,null,null,null,null,null,null,"連絡先"]
[]
[null,null,null,"特例引率者②",null,null,null,null,null,null,null,null,null,"連絡先"]
[]
[null,null,null,"特例引率者③",null,null,null,null,null,null,null,null,null,"連絡先"]
[]
[null,null,null,"特例引率者④",null,null,null,null,null,null,null,null,null,"連絡先"]
[]
[null,null,"※","競技役員名①",null,null,null,null,null,null,null,"※","参加日程"]
[]
[null,null,null,"競技役員名②",null,null,null,null,null,null,null,null,"参加日程",null,null,"初日のみ"]
[]
[null,null,null,"競技役員名③",null,null,null,null,null,null,null,null,"参加日程"]
[]
[null,null,null,"競技役員名④",null,null,null,null,null,null,null,null,"参加日程"]
[]
[null,null,null,null,null,null,null,null,null,null,null,"男","女"]
[null,"参加人数","※","参加人数",null,"自由形",null,null,"50m",null,null,null,null,null,"人数を入力してください",null,null,null,null,null,null,null,null,null,null,null,null,null,null,null,null,null,null,null,null,null,null,null,null,null,null,null,null,null,null,null,null,null,null,null,null,null,null,null,null,null,null,null,null,null,null,null,null,null,null,null,null,null,null,null,null,null,null,null,null,"参加日程",null,"区分",null,"審判資格"]
[null,null,null,null,null,null,null,null,"100m",null,null,null,null,null,null,null,null,null,null,null,null,null,null,null,null,null,"自　由　形",null,null,null,null,null,null,null,null,null,null,null,null,null,null,null,null,null,"背泳ぎ",null,null,null,null,null,"平泳ぎ",null,null,null,null,null,"ﾊﾞﾀﾌﾗｲ",null,null,null,null,null,"個人ﾒﾄﾞﾚｰ",null,null,null,null,null,"MR",null,null,"FR",null,null,null,"両日",null,"校長",null,"あり"]
[null,null,null,null,null,null,null,null,"200m",null,null,null,null,null,"※","登録選手数",null,null,null,"男子",1,null,"人",null,null,null,"50m",null,null,"100m",null,null,"200m",null,null,"400m",null,null,"800m",null,null,"1500m",null,null,"100m",null,null,"200m",null,null,"100m",null,null,"200m",null,null,"100m",null,null,"200m",null,null,"200m",null,null,"400m",null,null,"400m",null,null,"400m",null,null,null,"初日のみ",null,"教頭",null,"なし"]
[null,null,null,null,null,null,null,null,{"$f":"IF(I5=\"広島市中学校新人水泳競技大会\",\"-\",\"400m\")","v":"400m"},null,null,null,null,null,null,null,null,null,null,null,null,null,null,null,null,null,{"$f":"L42","v":0},null,null,{"$f":"L43","v":0},null,null,{"$f":"L44","v":0},null,null,{"$f":"L45","v":0},null,null,null,null,null,{"$f":"L47","v":0},null,null,{"$f":"L48","v":0},null,null,{"$f":"L49","v":0},null,null,{"$f":"L50","v":0},null,null,{"$f":"L51","v":1},null,null,{"$f":"L52","v":0},null,null,{"$f":"L53","v":0},null,null,{"$f":"L54","v":1},null,null,{"$f":"L55","v":0},null,null,{"$f":"L56","v":0},null,null,{"$f":"L57","v":0},null,null,null,"2日目のみ",null,"主幹"]
[null,null,null,null,null,null,null,null,{"$f":"IF(I5=\"広島市中学校新人水泳競技大会\",\"-\",\"800m\")","v":"800m"},null,null,null,null,null,null,null,null,null,null,"女子",1,null,"人",null,null,null,{"$f":"M42","v":0},null,null,{"$f":"M43","v":0},null,null,{"$f":"M44","v":0},null,null,{"$f":"M45","v":0},null,null,{"$f":"M46","v":0},null,null,null,null,null,{"$f":"M48","v":1},null,null,{"$f":"M49","v":1},null,null,{"$f":"M50","v":0},null,null,{"$f":"M51","v":0},null,null,{"$f":"M52","v":0},null,null,{"$f":"M53","v":0},null,null,{"$f":"M54","v":0},null,null,{"$f":"M55","v":0},null,null,{"$f":"M56","v":0},null,null,{"$f":"M57","v":0},null,null,null,null,null,"教諭"]
[null,null,null,null,null,null,null,null,{"$f":"IF(I5=\"広島市中学校新人水泳競技大会\",\"-\",\"1500m\")","v":"1500m"},null,null,null,null,null,null,null,"注意：オープン参加者を含めた人数を入力",null,null,null,null,null,null,null,null,null,null,null,null,null,null,null,null,null,null,null,null,null,null,null,null,null,null,null,null,null,null,null,null,null,null,null,null,null,null,null,null,null,null,null,null,null,null,null,null,null,null,null,null,null,null,null,null,null,null,null,null,"保護者"]
[null,null,null,null,null,"背泳ぎ",null,null,{"$f":"IF(I5=\"広島市中学校新人水泳競技大会\",\"50ｍ\",\"100m\")","v":"100m"},null,null,null,1,null,null,null,null,null,null,null,null,null,null,null,null,null,null,null,null,null,null,null,null,null,null,null,null,null,null,null,null,null,null,null,null,null,null,null,null,null,null,null,null,null,null,null,null,null,null,null,null,null,null,null,null,null,null,null,null,null,null,null,null,null,null,null,null,"その他"]
[null,null,null,null,null,null,null,null,{"$f":"IF(I5=\"広島市中学校新人水泳競技大会\",\"100ｍ\",\"200m\")","v":"200m"},null,null,null,1]
[null,null,null,null,null,"平泳ぎ",null,null,{"$f":"IF(I5=\"広島市中学校新人水泳競技大会\",\"50ｍ\",\"100m\")","v":"100m"}]
[null,null,null,null,null,null,null,null,{"$f":"IF(I5=\"広島市中学校新人水泳競技大会\",\"100ｍ\",\"200m\")","v":"200m"},null,null,1]
[null,null,null,null,null,"ﾊﾞﾀﾌﾗｲ",null,null,{"$f":"IF(I5=\"広島市中学校新人水泳競技大会\",\"50ｍ\",\"100m\")","v":"100m"}]
[null,null,null,null,null,null,null,null,{"$f":"IF(I5=\"広島市中学校新人水泳競技大会\",\"100ｍ\",\"200m\")","v":"200m"}]
[null,null,null,null,null,"個人ﾒﾄﾞﾚｰ",null,null,"200m",null,null,1,null,null,null,null,null,null,null,null,null,null,null,null,null,null,1]
[null,null,null,null,null,null,null,null,{"$f":"IF(I5=\"広島市中学校新人水泳競技大会\",\"-\",\"400m\")","v":"400m"}]
[null,null,null,null,null,"MR",null,null,{"$f":"IF(I5=\"広島市中学校水泳競技選手権大会\",\"400ｍ\",\"200m\")","v":"200m"},null,null,null,null,null,"出場の場合は，１を入力してください。"]
[null,null,null,null,null,"FR",null,null,{"$f":"IF(I5=\"広島市中学校水泳競技選手権大会\",\"400ｍ\",\"200m\")","v":"200m"}]
[]
[]
[]
[null,"問い合わせ先","※","申込責任者",null,"湯田　新"]
[]
[null,null,"※","Tel",null,"082－271－2260"]
[]
[null,null,"※","携帯電話",null,"090－3100－8078"]
[]
[]
[]
[]
[]
[]
[]
[]
[]
[]
[]
[]
[]
[]
[]
[]
[]
[]
[]
[]
[]
[]
[]
[]
[]
[]
[null,null,null,null,null,null,"自　由　形",null,null,null,null,null,null,null,null,null,null,null,null,null,null,null,null,null,"背泳ぎ",null,null,null,null,null,"平泳ぎ",null,null,null,null,null,"ﾊﾞﾀﾌﾗｲ",null,null,null,null,null,"個人ﾒﾄﾞﾚｰ",null,null,null,null,null,"MR",null,null,"FR"]
[null,null,null,null,null,null,"50m",null,null,"100m",null,null,"200m",null,null,"400m",null,null,"800m",null,null,"1500m",null,null,"100m",null,null,"200m",null,null,"100m",null,null,"200m",null,null,"100m",null,null,"200m",null,null,"200m",null,null,"400m",null,null,"400m",null,null,"400m"]
[null,null,null,null,null,null,{"$f":"#REF!","v":{"$error":"#REF!"}},null,null,{"$f":"#REF!","v":{"$error":"#REF!"}},null,null,{"$f":"#REF!","v":{"$error":"#REF!"}},null,null,{"$f":"#REF!","v":{"$error":"#REF!"}},null,null,null,null,null,{"$f":"#REF!","v":{"$error":"#REF!"}},null,null,{"$f":"#REF!","v":{"$error":"#REF!"}},null,null,{"$f":"#REF!","v":{"$error":"#REF!"}},null,null,{"$f":"#REF!","v":{"$error":"#REF!"}},null,null,{"$f":"#REF!","v":{"$error":"#REF!"}},null,null,{"$f":"#REF!","v":{"$error":"#REF!"}},null,null,{"$f":"#REF!","v":{"$error":"#REF!"}},null,null,{"$f":"#REF!","v":{"$error":"#REF!"}},null,null,{"$f":"#REF!","v":{"$error":"#REF!"}},null,null,{"$f":"#REF!","v":{"$error":"#REF!"}},null,null,{"$f":"#REF!","v":{"$error":"#REF!"}}]
[null,null,null,null,null,null,{"$f":"#REF!","v":{"$error":"#REF!"}},null,null,{"$f":"#REF!","v":{"$error":"#REF!"}},null,null,{"$f":"#REF!","v":{"$error":"#REF!"}},null,null,{"$f":"#REF!","v":{"$error":"#REF!"}},null,null,{"$f":"#REF!","v":{"$error":"#REF!"}},null,null,null,null,null,{"$f":"#REF!","v":{"$error":"#REF!"}},null,null,{"$f":"#REF!","v":{"$error":"#REF!"}},null,null,{"$f":"#REF!","v":{"$error":"#REF!"}},null,null,{"$f":"#REF!","v":{"$error":"#REF!"}},null,null,{"$f":"#REF!","v":{"$error":"#REF!"}},null,null,{"$f":"#REF!","v":{"$error":"#REF!"}},null,null,{"$f":"#REF!","v":{"$error":"#REF!"}},null,null,{"$f":"#REF!","v":{"$error":"#REF!"}},null,null,{"$f":"#REF!","v":{"$error":"#REF!"}},null,null,{"$f":"#REF!","v":{"$error":"#REF!"}}]
[]
[]
[]
[null,null,null,null,null,null,"広島市中学校水泳競技選手権大会"]
[null,null,null,null,null,null,"広島市中学校新人水泳競技大会"]
[null,null,null,null,null,null,"広島市中学校総合体育大会 水泳競技の部"]
[]
[]
[]
[null,null,null,null,null,null,"広島県中学校水泳競技選手権大会（競泳競技）"]
[null,null,null,null,null,null,"広島県中学校新人水泳競技大会"]
[]
[]
[]
[]
[null,null,null,null,null,null,"参加日程",null,null,null,"区分",null,null,null,"審判資格"]
[null,null,null,null,null,null,"両日",null,null,null,"校長",null,null,null,"あり"]
[null,null,null,null,null,null,"初日のみ",null,null,null,"教頭",null,null,null,"なし"]
[null,null,null,null,null,null,"2日目のみ",null,null,null,"主幹"]
[null,null,null,null,null,null,null,null,null,null,"教諭"]
[null,null,null,null,null,null,null,null,null,null,"保護者"]
[null,null,null,null,null,null,null,null,null,null,"その他"]
[]
[]
[]
[null,null,null,null,null,null,null,null,null,null,"区分"]
[null,null,null,null,null,null,null,null,null,null,"校長"]
[null,null,null,null,null,null,null,null,null,null,"教員"]
[null,null,null,null,null,null,null,null,null,null,"部活動指導員"]
[]
[]
[]
[]
[null,null,null,null,null,null,null,null,null,1,2,3,4,5,6,7,8,9,10]
[null,null,null,null,null,null,null,null,null,null,null,null,null,null,"市総体","県中",null,null,"県新人",null,null,null,"登録人数"]
[null,null,null,null,null,null,"元号1",null,null,"年","年齢",null,"西暦",null,null,"回数",null,null,"回数"]
[null,null,null,null,null,null,"令和",null,null,4,62,null,2022,null,70,62,null,null,2,null,null,null,0]
[null,null,null,null,null,null,"令和",null,null,5,63,null,2023,null,71,63,null,null,3,null,null,null,1]
[null,null,null,null,null,null,"令和",null,null,6,64,null,2024,null,72,64,null,null,4,null,null,null,2]
[null,null,null,null,null,null,"令和",null,null,7,65,null,2025,null,73,65,null,null,5,null,null,null,3]
[null,null,null,null,null,null,"令和",null,null,8,66,null,2026,null,74,66,null,null,6,null,null,null,4]
[null,null,null,null,null,null,"令和",null,null,9,67,null,2027,null,75,67,null,null,7,null,null,null,5]
[null,null,null,null,null,null,"令和",null,null,10,68,null,2028,null,76,68,null,null,8,null,null,null,6]
[null,null,null,null,null,null,"令和",null,null,11,69,null,2029,null,77,69,null,null,9,null,null,null,7]
[null,null,null,null,null,null,"令和",null,null,12,70,null,2030,null,78,70,null,null,10,null,null,null,8]
[null,null,null,null,null,null,"令和",null,null,13,71,null,2031,null,79,71,null,null,11,null,null,null,9]
[null,null,null,null,null,null,"令和",null,null,14,72,null,2032,null,80,72,null,null,12,null,null,null,10]
[null,null,null,null,null,null,"令和",null,null,15,73,null,2033,null,81,73,null,null,13,null,null,null,11]
[null,null,null,null,null,null,"令和",null,null,16,74,null,2034,null,82,74,null,null,14,null,null,null,12]
[null,null,null,null,null,null,"令和",null,null,17,75,null,2035,null,83,75,null,null,15,null,null,null,13]
[null,null,null,null,null,null,"令和",null,null,18,76,null,2036,null,84,76,null,null,16,null,null,null,14]
[null,null,null,null,null,null,"令和",null,null,19,77,null,2037,null,85,77,null,null,17,null,null,null,15]
[null,null,null,null,null,null,"令和",null,null,20,78,null,2038,null,86,78,null,null,18,null,null,null,16]
[null,null,null,null,null,null,"令和",null,null,21,79,null,2039,null,87,79,null,null,19,null,null,null,17]
[null,null,null,null,null,null,"令和",null,null,22,80,null,2040,null,88,80,null,null,20,null,null,null,18]
[null,null,null,null,null,null,"令和",null,null,23,81,null,2041,null,89,81,null,null,21,null,null,null,19]
[null,null,null,null,null,null,"令和",null,null,24,82,null,2042,null,90,82,null,null,22,null,null,null,20]
[null,null,null,null,null,null,"令和",null,null,25,83,null,2043,null,91,83,null,null,23,null,null,null,21]
[null,null,null,null,null,null,"令和",null,null,26,84,null,2044,null,92,84,null,null,24,null,null,null,22]
[null,null,null,null,null,null,"令和",null,null,27,85,null,2045,null,93,85,null,null,25,null,null,null,23]
[null,null,null,null,null,null,"令和",null,null,28,86,null,2046,null,94,86,null,null,26,null,null,null,24]
[null,null,null,null,null,null,"令和",null,null,29,87,null,2047,null,95,87,null,null,27,null,null,null,25]
[null,null,null,null,null,null,"令和",null,null,30,88,null,2048,null,96,88,null,null,28,null,null,null,26]
[null,null,null,null,null,null,"令和",null,null,31,89,null,2049,null,97,89,null,null,29,null,null,null,27]
[null,null,null,null,null,null,"令和",null,null,32,90,null,2050,null,98,90,null,null,30,null,null,null,28]
[null,null,null,null,null,null,"令和",null,null,33,91,null,2051,null,99,91,null,null,31,null,null,null,29]
[null,null,null,null,null,null,null,null,null,null,null,null,null,null,null,null,null,null,null,null,null,null,30]
[null,null,null,null,null,null,null,null,null,null,null,null,null,null,null,null,null,null,null,null,null,null,31]
[null,null,null,null,null,null,null,null,null,null,null,null,null,null,null,null,null,null,null,null,null,null,32]
[null,null,null,null,null,null,null,null,null,null,null,null,null,null,null,null,null,null,null,null,null,null,33]
[null,null,null,null,null,null,null,null,null,null,null,null,null,null,null,null,null,null,null,null,null,null,34]
[null,null,null,null,null,null,null,null,null,null,null,null,null,null,null,null,null,null,null,null,null,null,35]
[null,null,null,null,null,null,null,null,null,null,null,null,null,null,null,null,null,null,null,null,null,null,36]
[null,null,null,null,null,null,null,null,null,null,null,null,null,null,null,null,null,null,null,null,null,null,37]
[null,null,null,null,null,null,null,null,null,null,null,null,null,null,null,null,null,null,null,null,null,null,38]
[null,null,null,null,null,null,null,null,null,null,null,null,null,null,null,null,null,null,null,null,null,null,39]
[null,null,null,null,null,null,null,null,null,null,null,null,null,null,null,null,null,null,null,null,null,null,40]
[null,null,null,null,null,null,null,null,null,null,null,null,null,null,null,null,null,null,null,null,null,null,41]
[null,null,null,null,null,null,null,null,null,null,null,null,null,null,null,null,null,null,null,null,null,null,42]
[null,null,null,null,null,null,null,null,null,null,null,null,null,null,null,null,null,null,null,null,null,null,43]
[null,null,null,null,null,null,null,null,null,null,null,null,null,null,null,null,null,null,null,null,null,null,44]
[null,null,null,null,null,null,null,null,null,null,null,null,null,null,null,null,null,null,null,null,null,null,45]
[null,null,null,null,null,null,null,null,null,null,null,null,null,null,null,null,null,null,null,null,null,null,46]
[null,null,null,null,null,null,null,null,null,null,null,null,null,null,null,null,null,null,null,null,null,null,47]
[null,null,null,null,null,null,null,null,null,null,null,null,null,null,null,null,null,null,null,null,null,null,48]
[null,null,null,null,null,null,null,null,null,null,null,null,null,null,null,null,null,null,null,null,null,null,49]
[null,null,null,null,null,null,null,null,null,null,null,null,null,null,null,null,null,null,null,null,null,null,50]

{"sheet":"市大会申込書","index":10,"n_rows":54,"n_cols":40,"rows_kept":54,"cut":false,"hidden":true,"merged":[[7,7,7,18],[50,8,50,14],[50,17,50,21],[19,19,19,20],[10,15,10,21],[42,12,42,16],[42,18,42,21],[44,8,44,14],[44,17,44,21],[46,8,46,14],[46,17,46,21],[36,12,36,16],[36,18,36,21],[14,15,14,21],[12,5,17,10],[12,15,12,20],[21,18,21,20],[30,13,30,21],[24,18,24,19],[21,13,21,14],[24,14,24,15],[24,12,24,13],[24,6,24,11],[24,16,24,17],[48,8,48,14],[48,17,48,21],[40,18,40,21],[34,12,34,16],[32,8,32,13],[32,16,32,21],[34,18,34,21],[38,12,38,16],[38,18,38,21],[34,4,36,10],[40,12,40,16]]}
[1,2,3,4,5,6,7,8,9,10,11,12,13,14,15,16,17,18,19,20,21,22,23,24,25,26,27,28,29,30,31,32,33,34,35,36,37,38,39,40]
[]
[]
[null,null,null,null,null,null,null,null,null,null,null,null,null,null,null,"令和",{"$f":"IF(市大会入力シート!H3=\"\",\"\",市大会入力シート!H3)","v":4},"年",{"$f":"IF(市大会入力シート!J3=\"\",\"\",市大会入力シート!J3)","v":6},"月",{"$f":"IF(市大会入力シート!L3=\"\",\"\",市大会入力シート!L3)","v":27},"日"]
[]
[null,null,null,"広島市中学校体育連盟会長 様"]
[]
[null,null,null,null,null,null,null,{"$f":"IF(市大会入力シート!I5=\"\",\"\",市大会入力シート!I5)&\" 申込書\"","v":"広島市中学校総合体育大会 水泳競技の部 申込書"}]
[]
[]
[null,null,null,null,null,null,null,null,null,null,null,null,"学　校",null,null,{"$f":"IF(市大会入力シート!F8=\"\",\"\",市大会入力シート!F8)","v":"広島市立己斐中学校"}]
[]
[null,null,null,null,null,"　下記の通り，大会に出場することを認め，参加申込をします。また，本大会プログラム作成及び成績上位者の報道発表並びにWebページにおいて選手名，学年，学校名等の個人情報の記載について，本人・保護者の同意を得ています。",null,null,null,null,null,null,"校　長",null,null,{"$f":"IF(市大会入力シート!F12=\"\",\"\",市大会入力シート!F12)","v":"溝下　明美"},null,null,null,null,null,"印"]
[]
[null,null,null,null,null,null,null,null,null,null,null,null,"申込責任者",null,null,{"$f":"IF(市大会入力シート!F61=\"\",\"\",市大会入力シート!F61)","v":"湯田　新"}]
[]
[]
[]
[]
[null,null,null,null,"登録選手数",null,null,null,"男子",null,{"$f":"IF(市大会入力シート!U44=\"\",\"\",市大会入力シート!U44)","v":1},"人",null,"女子",null,{"$f":"IF(市大会入力シート!U46=\"\",\"\",市大会入力シート!U46)","v":1},"人",null,"計",{"$f":"K20+P20","v":2},null,"人"]
[]
[null,null,null,null,"大会負担金",null,null,null,100,"円×","登録選手数",null,null,{"$f":"T20","v":2},null,"人",null,"計",{"$f":"I22*N22","v":200},null,null,"円"]
[]
[null,null,null,null,"種目別参加者数（オープン参加を含まない）"]
[null,null,null,null,null,"種目","自由形",null,null,null,null,null,"背泳ぎ",null,"平泳ぎ",null,"ﾊﾞﾀﾌﾗｲ",null,"個人メ",null,"MR","FR"]
[null,null,null,null,null,"距離",50,100,200,{"$f":"IF($H$8=\"広島市中学校新人水泳競技大会 申込書\",\"**\",\"400\")","v":"400"},{"$f":"IF($H$8=\"広島市中学校新人水泳競技大会 申込書\",\"**\",\"800\")","v":"800"},{"$f":"IF($H$8=\"広島市中学校新人水泳競技大会 申込書\",\"**\",\"1500\")","v":"1500"},{"$f":"IF($H$8=\"広島市中学校新人水泳競技大会 申込書\",\"50\",\"100\")","v":"100"},{"$f":"IF($H$8=\"広島市中学校新人水泳競技大会 申込書\",\"100\",\"200\")","v":"200"},{"$f":"IF($H$8=\"広島市中学校新人水泳競技大会 申込書\",\"50\",\"100\")","v":"100"},{"$f":"IF($H$8=\"広島市中学校新人水泳競技大会 申込書\",\"100\",\"200\")","v":"200"},{"$f":"IF($H$8=\"広島市中学校新人水泳競技大会 申込書\",\"50\",\"100\")","v":"100"},{"$f":"IF($H$8=\"広島市中学校新人水泳競技大会 申込書\",\"100\",\"200\")","v":"200"},{"$f":"IF($H$8=\"広島市中学校新人水泳競技大会 申込書\",\"200\",\"200\")","v":"200"},{"$f":"IF($H$8=\"広島市中学校新人水泳競技大会 申込書\",\"200\",\"400\")","v":"400"},{"$f":"IF($H$8=\"広島市中学校新人水泳競技大会 申込書\",\"200\",\"400\")","v":"400"},{"$f":"IF($H$8=\"広島市中学校新人水泳競技大会 申込書\",\"200\",\"400\")","v":"400"}]
[null,null,null,null,null,"男子",{"$f":"IF(市大会入力シート!AA45=\"\",\"\",市大会入力シート!AA45)","v":0},{"$f":"IF(市大会入力シート!AD45=\"\",\"\",市大会入力シート!AD45)","v":0},{"$f":"IF(市大会入力シート!AG45=\"\",\"\",市大会入力シート!AG45)","v":0},{"$f":"IF(市大会入力シート!AJ45=\"\",\"\",市大会入力シート!AJ45)","v":0},"-",{"$f":"IF(市大会入力シート!AP45=\"\",\"\",市大会入力シート!AP45)","v":0},{"$f":"IF(市大会入力シート!AS45=\"\",\"\",市大会入力シート!AS45)","v":0},{"$f":"IF(市大会入力シート!AV45=\"\",\"\",市大会入力シート!AV45)","v":0},{"$f":"IF(市大会入力シート!AY45=\"\",\"\",市大会入力シート!AY45)","v":0},{"$f":"IF(市大会入力シート!BB45=\"\",\"\",市大会入力シート!BB45)","v":1},{"$f":"IF(市大会入力シート!BE45=\"\",\"\",市大会入力シート!BE45)","v":0},{"$f":"IF(市大会入力シート!BH45=\"\",\"\",市大会入力シート!BH45)","v":0},{"$f":"IF(市大会入力シート!BK45=\"\",\"\",市大会入力シート!BK45)","v":1},{"$f":"IF(市大会入力シート!BN45=\"\",\"\",市大会入力シート!BN45)","v":0},{"$f":"IF(市大会入力シート!BQ45=1,\"○\",\"\")","v":""},{"$f":"IF(市大会入力シート!BT45=1,\"○\",\"\")","v":""}]
[null,null,null,null,null,"女子",{"$f":"IF(市大会入力シート!AA46=\"\",\"\",市大会入力シート!AA46)","v":0},{"$f":"IF(市大会入力シート!AD46=\"\",\"\",市大会入力シート!AD46)","v":0},{"$f":"IF(市大会入力シート!AG46=\"\",\"\",市大会入力シート!AG46)","v":0},{"$f":"IF(市大会入力シート!AJ46=\"\",\"\",市大会入力シート!AJ46)","v":0},{"$f":"IF(市大会入力シート!AM46=\"\",\"\",市大会入力シート!AM46)","v":0},"-",{"$f":"IF(市大会入力シート!AS46=\"\",\"\",市大会入力シート!AS46)","v":1},{"$f":"IF(市大会入力シート!AV46=\"\",\"\",市大会入力シート!AV46)","v":1},{"$f":"IF(市大会入力シート!AY46=\"\",\"\",市大会入力シート!AY46)","v":0},{"$f":"IF(市大会入力シート!BB46=\"\",\"\",市大会入力シート!BB46)","v":0},{"$f":"IF(市大会入力シート!BE46=\"\",\"\",市大会入力シート!BE46)","v":0},{"$f":"IF(市大会入力シート!BH46=\"\",\"\",市大会入力シート!BH46)","v":0},{"$f":"IF(市大会入力シート!BK46=\"\",\"\",市大会入力シート!BK46)","v":0},{"$f":"IF(市大会入力シート!BN46=\"\",\"\",市大会入力シート!BN46)","v":0},{"$f":"IF(市大会入力シート!BQ46=1,\"○\",\"\")","v":""},{"$f":"IF(市大会入力シート!BT46=1,\"○\",\"\")","v":""}]
[null,null,null,null,null,null,null,"（個人種目は3名以内で人数を記入する。リレー種目は1チームまで。○を記入する。）"]
[]
[null,null,null,null,"申込責任者連絡先携帯電話番号",null,null,null,null,null,null,null,null,{"$f":"IF(市大会入力シート!F65=\"\",\"\",市大会入力シート!F65)","v":"090－3100－8078"}]
[]
[null,null,null,null,"学校引率者名",null,null,null,{"$f":"IF(市大会入力シート!F23=\"\",\"\",市大会入力シート!F23)","v":""},null,null,null,null,null,null,"区分",{"$f":"IF(市大会入力シート!P23=\"\",\"\",市大会入力シート!P23)","v":""}]
[]
[null,null,null,null,"大会引率者の特例による\n                              引率者名",null,null,null,null,null,null,"①",{"$f":"IF(市大会入力シート!F25=\"\",\"\",市大会入力シート!F25)","v":""},null,null,null,null,"連絡先",{"$f":"IF(市大会入力シート!P25=\"\",\"\",市大会入力シート!P25)","v":""}]
[]
[null,null,null,null,null,null,null,null,null,null,null,"②",{"$f":"IF(市大会入力シート!F27=\"\",\"\",市大会入力シート!F27)","v":""},null,null,null,null,"連絡先",{"$f":"IF(市大会入力シート!P27=\"\",\"\",市大会入力シート!P27)","v":""}]
[]
[null,null,null,null,null,null,null,null,null,null,null,"③",{"$f":"IF(市大会入力シート!F29=\"\",\"\",市大会入力シート!F29)","v":""},null,null,null,null,"連絡先",{"$f":"IF(市大会入力シート!P29=\"\",\"\",市大会入力シート!P29)","v":""}]
[]
[null,null,null,null,null,null,null,null,null,null,null,"④",{"$f":"IF(市大会入力シート!F31=\"\",\"\",市大会入力シート!F31)","v":""},null,null,null,null,"連絡先",{"$f":"IF(市大会入力シート!P31=\"\",\"\",市大会入力シート!P31)","v":""}]
[]
[]
[]
[null,null,null,null,"競技役員氏名",null,null,"①",{"$f":"IF(市大会入力シート!F33=\"\",\"\",市大会入力シート!F33)","v":""},null,null,null,null,null,null,null,"日程",{"$f":"IF(市大会入力シート!P33=\"\",\"\",市大会入力シート!P33)","v":""}]
[]
[null,null,null,null,null,null,null,"②",{"$f":"IF(市大会入力シート!F35=\"\",\"\",市大会入力シート!F35)","v":""},null,null,null,null,null,null,null,"日程",{"$f":"IF(市大会入力シート!P35=\"\",\"\",市大会入力シート!P35)","v":"初日のみ"}]
[]
[null,null,null,null,null,null,null,"③",{"$f":"IF(市大会入力シート!F37=\"\",\"\",市大会入力シート!F37)","v":""},null,null,null,null,null,null,null,"日程",{"$f":"IF(市大会入力シート!P37=\"\",\"\",市大会入力シート!P37)","v":""}]
[]
[null,null,null,null,null,null,null,"④",{"$f":"IF(市大会入力シート!F39=\"\",\"\",市大会入力シート!F39)","v":""},null,null,null,null,null,null,null,"日程",{"$f":"IF(市大会入力シート!P39=\"\",\"\",市大会入力シート!P39)","v":""}]
[]
[]
[null,null,null,null,null,null,null,null,null,null,null,null,null,null,null,"https://swim34.jp/"]

{"sheet":"市大会負担金納入書","index":11,"n_rows":56,"n_cols":15,"rows_kept":56,"cut":false,"hidden":true,"merged":[[34,6,34,13],[35,6,35,13],[41,7,41,9],[17,9,17,13],[19,9,19,13],[21,9,21,13],[23,9,23,13],[25,9,25,13],[30,4,30,13]]}
[]
[]
[]
[]
[]
[]
[]
[null,null,"大会負担金納入書（様式1）　各学校提出用"]
[]
[]
[null,null,null,null,null,null,null,null,null,null,null,null,{"$f":"市大会入力シート!F3&\" \"&市大会入力シート!H3&\" 年 \"&市大会入力シート!J3&\" 月 \"&市大会入力シート!L3&\" 日\"","v":"令和 4 年 6 月 27 日"}]
[]
[]
[null,null,"広島市中学校体育連盟会長 様"]
[]
[]
[]
[null,null,null,null,null,null,null,"学校名",null,{"$f":"市大会入力シート!F8","v":"広島市立己斐中学校"}]
[]
[null,null,null,null,null,null,null,"住所",null,{"$f":"市大会入力シート!I16","v":"広島市西区己斐上3-35-1"}]
[]
[null,null,null,null,null,null,null,"電話",null,{"$f":"市大会入力シート!F18","v":"082-271-2260"}]
[]
[null,null,null,null,null,null,null,"校長名",null,{"$f":"市大会入力シート!F12","v":"溝下　明美"},null,null,null,null,"印"]
[]
[null,null,null,null,null,null,null,"監督名",null,{"$f":"市大会入力シート!F61","v":"湯田　新"},null,null,null,null,"印"]
[]
[]
[]
[]
[null,null,null,null,"広島市中学校体育連盟　大会負担金納入書"]
[]
[]
[null,null,null,null,"　　次の大会へ本校の生徒が参加しますので，大会負担金を納入します。"]
[null,null,null,null,"大会名",null,{"$f":"市大会入力シート!F5&\"　\"&市大会入力シート!I5","v":"第70回　広島市中学校総合体育大会 水泳競技の部"}]
[null,null,null,null,"競技種目",null,"水泳競技"]
[null,null,null,null,"参加生徒数",null,"男子",{"$f":"市大会入力シート!U44&\" 名\"","v":"1 名"},null,"女子",{"$f":"市大会入力シート!U46&\" 名\"","v":"1 名"},"合計",{"$f":"市大会入力シート!U44+市大会入力シート!U46&\" 名\"","v":"2 名"},{"$f":"H37+K37","v":{"$error":"#VALUE!"}}]
[]
[]
[null,null,null,null,null,null,100,"円　×",null,{"$f":"市大会入力シート!U44+市大会入力シート!U46","v":2},"名分"]
[null,null,null,null,"大会負担金"]
[null,null,null,null,null,null,null,{"$f":"G40*J40","v":200},null,null,"円"]
[]
[]
[]
[null,null,null,null,"　※　スコアラー・マネージャー等が生徒の場合は登録選手に含む。"]
[null,null,null,null,"　※　メンバー表のコピーを裏面に添付すること。"]
[null,null,null,null,"　※　原則として大会負担金の返金は行わない。但し，大会が全く実施できなかった場合に"]
[null,null,null,null,"　　　　のみ，必要経費を除いた後に返金する。（全額にならない場合がある）"]
[]
[]
[]
[]
[]
[]
[null,null,null,null,null,null,null,null,null,null,null,"https://swim34.jp/",null,null,{"$f":"VLOOKUP(J18,学校一覧,2,FALSE)","v":"34A30"}]

{"sheet":"市特例申請書","index":12,"n_rows":56,"n_cols":16,"rows_kept":56,"cut":false,"hidden":true,"merged":[[9,5,9,13],[26,10,26,14],[38,7,38,14],[39,7,39,14],[41,7,41,14],[18,10,18,14],[22,10,22,14],[24,10,24,14],[20,10,20,14],[32,5,32,14],[43,7,43,14],[46,9,46,14],[55,13,55,15],[40,7,40,11],[36,7,36,14],[37,7,37,14],[42,7,42,14]]}
[1]
[]
[]
[]
[]
[]
[]
[null,null,null,"引率者の特例申請様式（広島市中学校体育連盟）"]
[]
[null,null,null,null,null,"広島市中学校体育連盟　大会引率者の特例申請書"]
[]
[]
[null,null,null,null,null,null,null,null,null,null,null,null,{"$f":"市大会入力シート!F3&\" \"&市大会入力シート!H3&\" 年 \"&市大会入力シート!J3&\" 月 \"&市大会入力シート!L3&\" 日\"","v":"令和 4 年 6 月 27 日"}]
[]
[null,null,null,"　広島市中学校体育連盟会長 様"]
[]
[]
[]
[null,null,null,null,null,null,null,null,"学校名",null,{"$f":"市大会入力シート!F8","v":"広島市立己斐中学校"}]
[]
[null,null,null,null,null,null,null,null,"校長名",null,{"$f":"市大会入力シート!F12","v":"溝下　明美"},null,null,null,null,"印"]
[]
[null,null,null,null,null,null,null,null,"住所",null,{"$f":"市大会入力シート!I16","v":"広島市西区己斐上3-35-1"}]
[]
[null,null,null,null,null,null,null,null,"TEL",null,{"$f":"市大会入力シート!F18","v":"082-271-2260"}]
[]
[null,null,null,null,null,null,null,null,"FAX",null,{"$f":"市大会入力シート!F20","v":"082-271-5499"}]
[]
[]
[]
[]
[]
[null,null,null,null,null,"次の者を下記大会への本校引率者として申請します。"]
[]
[]
[]
[null,null,null,null,null,"大会名",null,{"$f":"市大会入力シート!F5&\"　\"&市大会入力シート!I5","v":"第70回　広島市中学校総合体育大会 水泳競技の部"}]
[null,null,null,null,null,"参加競技名",null,"水泳競技"]
[null,null,null,null,null,"出場種目名",null,{"$f":"VLOOKUP(A1,特例引率選手名簿,5,FALSE)&\" \"&VLOOKUP(A1,特例引率選手名簿,6,FALSE)&\"   \"&VLOOKUP(A1,特例引率選手名簿,7,FALSE)","v":"    "}]
[null,null,null,null,null,"引率者の分類",null,{"$f":"VLOOKUP(A1,特例引率選手名簿,9,FALSE)","v":0}]
[null,null,null,null,null,"引率選手名",null,{"$f":"VLOOKUP(A1,特例引率選手名簿,4,FALSE)","v":"yuda"},null,null,null,null,{"$f":"\"( \"&LEFT(VLOOKUP(A1,特例引率選手名簿,5,FALSE),1)&\" )\"","v":"(  )"}]
[null,null,null,null,null,"引率者名",null,{"$f":"VLOOKUP(A1,特例引率選手名簿,8,FALSE)","v":0}]
[null,null,null,null,null,"引率者住所",null,{"$f":"VLOOKUP(A1,特例引率選手名簿,10,FALSE)","v":0}]
[null,null,null,null,null,"引率者連絡方法",null,{"$f":"VLOOKUP(A1,特例引率選手名簿,11,FALSE)","v":0}]
[null,null,null,null,null,"選手及び引率者任意保険加入状況",null,null,null,null,"選手・・・",{"$f":"VLOOKUP(A1,特例引率選手名簿,12,FALSE)","v":0},"引率者・・・",{"$f":"VLOOKUP(A1,特例引率選手名簿,13,FALSE)","v":0}]
[]
[null,null,null,null,null,null,"記載責任者名",null,null,{"$f":"市大会入力シート!F61","v":"湯田　新"}]
[]
[]
[null,null,null,null,"※大会参加申し込み時には，申請書原本を申込書とともに大会要項に記載の申込先へ提出する。"]
[]
[]
[]
[]
[]
[null,null,null,null,null,null,null,null,null,null,null,"https://swim34.jp/",null,{"$f":"VLOOKUP(K19,学校一覧,2,FALSE)","v":"34A30"}]

{"sheet":"H30～新様式K 記入方法","index":13,"n_rows":51,"n_cols":54,"rows_kept":51,"cut":false,"hidden":true,"merged":[[38,7,38,9],[38,10,38,12],[40,34,40,36],[40,10,40,12],[1,1,1,2],[37,2,37,6],[38,2,38,6],[39,2,39,6],[21,2,21,12],[40,2,40,6],[39,22,39,24],[40,7,40,9],[39,10,39,12],[39,13,39,15],[39,16,39,18],[40,13,40,15],[40,52,40,54],[40,43,40,45],[40,46,40,48],[39,49,39,51],[40,49,40,51],[40,40,40,42],[40,25,40,27],[40,28,40,30],[40,31,40,33],[40,19,40,21],[40,22,40,24],[40,37,40,39],[39,7,39,9],[39,19,39,21],[39,52,39,54],[39,40,39,42],[39,43,39,45],[39,25,39,27],[39,28,39,30],[39,37,39,39],[39,31,39,33],[39,46,39,48],[39,34,39,36],[37,43,37,48],[37,52,37,54],[38,43,38,45],[38,46,38,48],[38,49,38,51],[38,52,38,54],[37,49,37,51],[16,15,17,18],[16,20,17,22],[38,37,38,39],[38,40,38,42],[10,7,11,21],[12,8,13,20],[14,8,15,11],[14,13,15,18],[21,41,21,54],[11,49,13,51],[22,3,23,12],[38,13,38,15],[38,22,38,24],[38,16,38,18],[38,19,38,21],[37,7,37,24],[11,43,13,45],[16,45,17,53],[11,46,13,48],[22,29,23,37],[23,38,23,39],[14,28,15,33],[14,35,15,52],[16,24,17,31],[16,36,17,39],[16,41,17,43],[11,37,13,39],[11,40,13,42],[43,7,44,16],[45,6,46,8],[45,10,46,12],[45,14,46,20],[21,29,21,40],[21,13,21,27],[37,25,37,30],[45,27,46,29],[45,31,46,40],[38,25,38,27],[38,28,38,30],[37,31,37,36],[37,37,37,42],[38,31,38,33],[38,34,38,36],[40,16,40,18]]}
[]
[null,"様式K",null,null,"（出場校　→　郡市委員長）",null,null,null,null,null,null,null,null,null,null,null,null,null,null,null,"大会参加申込書"]
[null,null,null,null,null,null,null,null,null,null,null,null,null,null,null,null,null,null,null,null,null,null,null,null,null,null,null,null,null,null,null,null,null,null,null,null,null,null,null,null,null,null,null,"平成",null,"x","x","年",null,"x","月","x","x","日"]
[null,"広島県中学校体育連盟会長 様"]
[]
[null,null,null,null,"□","第",null,null,null,"回　広島県中学校水泳競技選手権大会（競泳競技）"]
[null,"　下記の通り，",null,null,null,null,null,null,null,null,null,null,null,null,null,null,null,null,null,null,null,null,null,null,null,null,null,null,null,null,null,null,"に別添一覧の選手が出場することを認め，参加申し込みを致します。"]
[null,null,null,null,"□","第",null,"x","x","回　広島県中学校総合体育大会（水泳競技の部）"]
[]
[null,null,"■出場校"]
[null,null,null,null,null,null,null,"広島市立中広"]
[null,null,null,"中学校名",null,null,null,null,null,null,null,null,null,null,null,null,null,null,null,null,null,null,"中学校",null,null,null,null,null,null,null,null,null,null,null,null,null,null,3,null,null,4,null,null,"A",null,null,2,null,null,8]
[null,null,null,null,null,null,null,null,"片田　威夫",null,null,null,null,null,null,null,null,null,null,null,null,null,null,null,null,null,null,null,null,null,null,null,"団体登録番号"]
[null,null,null,"校長名",null,null,null,null,null,null,null,null,null,null,null,null,null,null,null,null,null,null,null,null,null,"印"]
[null,null,null,null,null,null,null,null,732,null,null,null,null,"0012",null,null,null,null,null,null,null,null,null,null,null,null,null,null,"広島",null,null,null,null,null,"市","西区温中広町三丁目1番41号"]
[null,null,null,"所在地",null,null,null,"〒",null,null,null,null,"－",null,null,null,null,null,null,null,null,null,null,"広島県",null,null,null,null,null,null,null,null,null,null,"郡"]
[null,null,null,null,null,null,null,null,null,null,null,null,null,null,null,"082",null,null,null,null,232,null,null,null,2291,null,null,null,null,null,null,null,null,null,null,null,"082",null,null,null,null,231,null,null,null,7417]
[null,null,null,null,null,null,null,null,null,null,null,null,"TEL",null,"（",null,null,null,null,"）",null,null,null,"－",null,null,null,null,null,null,null,null,null,"FAX",null,"（",null,null,null,null,"）",null,null,null,"－"]
[]
[]
[null,null,"■引率者",null,null,null,null,null,null,null,null,null,null,null,null,null,null,null,null,null,null,null,null,null,null,null,null,null,null,"■競技役員"]
[null,null,"引　率　者　名",null,null,null,null,null,null,null,null,null,null,"区　　　　分",null,null,null,null,null,null,null,null,null,null,null,null,null,null,null,"競　技　役　員　名",null,null,null,null,null,null,null,null,null,null,null,"参加日程　/　区　　分 "]
[null,null,null,"湯　　田　　　新",null,null,null,null,null,null,null,null,null,null,null,null,null,null,null,null,null,null,null,null,null,null,null,null,null,"湯　　田　　　新",null,null,null,null,null,null,null,null,null,null,null,"□両日　　□初日のみ　　□2日目のみ"]
[null,null,null,null,null,null,null,null,null,null,null,null,null,"□校長  □教頭  □主幹 □教諭  □保護者 □その他",null,null,null,null,null,null,null,null,null,null,null,null,null,null,null,null,null,null,null,null,null,null,null,null,"(1)",null,null,"□校長  □教頭  □主幹 □教諭  □保護者 □その他"]
[null,null,null,null,null,null,null,null,null,null,null,null,null,null,null,null,null,null,null,null,null,null,null,null,null,null,null,null,null,null,null,null,null,null,null,null,null,null,null,null,null,"□両日　　□初日のみ　　□2日目のみ"]
[null,null,null,null,null,null,null,null,null,null,null,null,null,"□校長  □教頭  □主幹 □教諭  □保護者 □その他",null,null,null,null,null,null,null,null,null,null,null,null,null,null,null,null,null,null,null,null,null,null,null,null,"(      )",null,null,"□校長  □教頭  □主幹 □教諭  □保護者 □その他"]
[null,null,null,null,null,null,null,null,null,null,null,null,null,null,null,null,null,null,null,null,null,null,null,null,null,null,null,null,null,null,null,null,null,null,null,null,null,null,null,null,null,"□両日　　□初日のみ　　□2日目のみ"]
[null,null,null,null,null,null,null,null,null,null,null,null,null,"□校長  □教頭  □主幹 □教諭  □保護者 □その他",null,null,null,null,null,null,null,null,null,null,null,null,null,null,null,null,null,null,null,null,null,null,null,null,"(      )",null,null,"□校長  □教頭  □主幹 □教諭  □保護者 □その他"]
[null,null,null,null,null,null,null,null,null,null,null,null,null,null,null,null,null,null,null,null,null,null,null,null,null,null,null,null,null,null,null,null,null,null,null,null,null,null,null,null,null,"□両日　　□初日のみ　　□2日目のみ"]
[null,null,null,null,null,null,null,null,null,null,null,null,null,"□校長  □教頭  □主幹 □教諭  □保護者 □その他",null,null,null,null,null,null,null,null,null,null,null,null,null,null,null,null,null,null,null,null,null,null,null,null,"(      )",null,null,"□校長  □教頭  □主幹 □教諭  □保護者 □その他"]
[null,null,null,null,null,null,null,null,null,null,null,null,null,null,null,null,null,null,null,null,null,null,null,null,null,null,null,null,null,null,null,null,null,null,null,null,null,null,null,null,null,"□両日　　□初日のみ　　□2日目のみ"]
[null,null,null,null,null,null,null,null,null,null,null,null,null,"□校長  □教頭  □主幹 □教諭  □保護者 □その他",null,null,null,null,null,null,null,null,null,null,null,null,null,null,null,null,null,null,null,null,null,null,null,null,"(      )",null,null,"□校長  □教頭  □主幹 □教諭  □保護者 □その他"]
[null,null,null,null,null,null,null,null,null,null,null,null,null,null,null,null,null,null,null,null,null,null,null,null,null,null,null,null,null,null,null,"※大会引率者の特例で大会参加の場合，競技役員は１名のみ記入してください。"]
[null,null,null,null,null,null,null,null,null,null,null,null,null,null,"※該当区分の□にﾁｪｯｸを入れてください。",null,null,null,null,null,null,null,null,null,null,null,null,null,null,null,null,"※（　　　）内には，資格を記入してください。（上級･1種/A･B級…「１」，2種/C級…「２」，なし…「０」）"]
[null,null,null,null,null,null,null,null,null,null,null,null,null,null,null,null,null,null,null,null,null,null,null,null,null,null,null,null,null,null,null,"※参加日程/区分の□にﾁｪｯｸを入れてください。"]
[]
[null,null,"■参加人数"]
[null,null,"種　目",null,null,null,null,"自　由　形",null,null,null,null,null,null,null,null,null,null,null,null,null,null,null,null,null,"背泳ぎ",null,null,null,null,null,"平泳ぎ",null,null,null,null,null,"ﾊﾞﾀﾌﾗｲ",null,null,null,null,null,"個人ﾒﾄﾞﾚｰ",null,null,null,null,null,"MR",null,null,"FR"]
[null,null,"距　離",null,null,null,null,"50m",null,null,"100m",null,null,"200m",null,null,"400m",null,null,"800m",null,null,"1500m",null,null,"100m",null,null,"200m",null,null,"100m",null,null,"200m",null,null,"100m",null,null,"200m",null,null,"200m",null,null,"400m",null,null,"200/400",null,null,"200/400"]
[null,null,"男　子",null,null,null,null,2,null,null,1,null,null,3,null,null,3,null,null,"-",null,null,1,null,null,2,null,null,1,null,null,3,null,null,3,null,null,1,null,null,1,null,null,1,null,null,2,null,null,"○",null,null,"○"]
[null,null,"女　子",null,null,null,null,2,null,null,1,null,null,2,null,null,1,null,null,2,null,null,"-",null,null,2,null,null,1,null,null,3,null,null,3,null,null,1,null,null,1,null,null,1,null,null,2,null,null,"○",null,null,"○"]
[]
[null,null,"■問い合わせ先",null,null,null,null,null,null,null,null,null,null,null,null,null,null,null,null,null,null,null,null,null,null,null,null,null,null,null,null,null,null,null,null,null,null,null,null,null,null,null,"※ﾘﾚｰ種目については，出場の場合に○印を記入してください。"]
[null,null,null,null,null,null,null,"湯　田　　　新",null,null,null,null,null,null,null,null,null,null,null,null,null,null,null,null,null,null,null,null,null,null,null,null,null,null,null,null,null,null,null,null,null,null,"※ﾘﾚｰ種目…県選手権は，MR,FR男女共に400m。"]
[null,null,null,"お名前",null,null,null,null,null,null,null,null,null,null,null,null,null,null,"（ 校長 ， 教頭 ， 主幹　，教諭 ， 保護者 ， その他 ）",null,null,null,null,null,null,null,null,null,null,null,null,null,null,null,null,null,null,null,null,null,null,null,"　　　　　　  　　県総体は，MR,FR男女共に200m。"]
[null,null,null,null,null,null,"082",null,null,null,232,null,null,null,2291,null,null,null,null,null,null,null,null,null,null,null,null,"090",null,null,null,"3100-80**",null,null,null,null,null,null,null,null,null,null,"　　　　　　  　　県総体の郡市対抗ﾘﾚｰ申込は，この用紙には記載"]
[null,null,null,"TEL",null,"（",null,null,null,"）",null,null,null,"－",null,null,null,null,null,null,null,null,"携帯電話",null,null,null,"（",null,null,null,"）",null,null,null,null,null,null,null,null,null,null,null,"　　　　　　　　　しません。"]
[]
[]
[null,null,"※ 参加申し込みにあたり，各中学校の担当者が，Web上での選手登録・年度更新・ｴﾝﾄﾘｰ等の入力を終えていること。",null,null,null,null,null,null,null,null,null,null,null,null,null,null,null,null,null,null,null,null,null,null,null,null,null,null,null,null,"※ 別添一覧の選手は，Webｴﾝﾄﾘｰされており，この一覧は，Web-SWMSYSからﾌﾟﾘﾝﾄｱｳﾄされたものであること。"]
[null,null,"※ 標記大会の申込にあたり，大会ﾌﾟﾛｸﾞﾗﾑ等及び報道発表（新聞・Webﾍﾟｰｼﾞ等）における選手名，学年，所属等の個人情報の記載について，本人・保護者の同意を得ていること。",null,null,null,null,null,null,null,null,null,null,null,null,null,null,null,null,null,null,null,null,null,null,null,null,null,null,null,null,null,null,null,null,null,null,null,null,null,null,null,null,null,null,null,null,"https://.swim34.jp/"]

{"sheet":"特例引率選手名簿","index":14,"n_rows":96,"n_cols":27,"rows_kept":96,"cut":false,"hidden":true,"merged":[]}
[1,2,3,4,5,6,7,8,9,10,11,12,13,14,15,16,17,18,19,20,21,22,23]
[2,null,1,2,3,4,5,6,7,8,9,10,11,12,13,14,15,16,17,17,18,19,20,21,22,23,24]
[3]
[4]
[5]
[6,null,null,null,null,"特例引率選手名簿"]
[7]
[8]
[9,null,"連番",null,"出場\n有無","選手名","性別","出場種目①","出場種目②","引率者名","引率者\n分類","引率者住所","連絡方法","選手\n保険","引率者\n保険","備忘録(自由記述)"]
[10,null,1,null,"有り","yuda",null,null,null,null,null,null,null,null,null,"1-1-21　市大会のみ出場"]
[11,null,2,null,null,null,null,null,null,null,null,null,null,null,null,"3-★-★"]
[12,null,3]
[13,null,4]
[14,null,5]
[15,null,6]
[16,null,7]
[17,null,8]
[18,null,9]
[19,null,10]
[20,null,11]
[21,null,12]
[22,null,13]
[23,null,14]
[24,null,15]
[25,null,16]
[26,null,17]
[27,null,18]
[28,null,19]
[29,null,20]
[30,null,21]
[31,null,22]
[32,null,23]
[33,null,24]
[34,null,25]
[35,null,26]
[36,null,27]
[37,null,28]
[38,null,29]
[39,null,30]
[40]
[41]
[42]
[43]
[44]
[45]
[46]
[47]
[48]
[49]
[50]
[]
[]
[]
[]
[]
[]
[]
[]
[]
[]
[]
[]
[]
[]
[]
[]
[]
[]
[]
[]
[]
[]
[]
[]
[]
[]
[]
[]
[null,null,null,null,null,"性別",null,"出場種目",null,"引率者分類",null,"保険"]
[null,null,null,null,null,"男子",null,"50m自由形",null,"保護者",null,"有り"]
[null,null,null,null,null,"女子",null,"100m自由形",null,"地域のｽﾎﾟｰﾂ指導者"]
[null,null,null,null,null,null,null,"200m自由形",null,"保護者(続柄 父)"]
[null,null,null,null,null,null,null,"400m自由形",null,"保護者(続柄 母)"]
[null,null,null,null,null,null,null,"800m自由形",null,"ｽﾎﾟｰﾂ指導者(成人)"]
[null,null,null,null,null,null,null,"1500m自由形"]
[null,null,null,null,null,null,null,"50m背泳ぎ"]
[null,null,null,null,null,null,null,"100m背泳ぎ"]
[null,null,null,null,null,null,null,"200m背泳ぎ"]
[null,null,null,null,null,null,null,"50m平泳ぎ"]
[null,null,null,null,null,null,null,"100m平泳ぎ"]
[null,null,null,null,null,null,null,"200m平泳ぎ"]
[null,null,null,null,null,null,null,"50mﾊﾞﾀﾌﾗｲ"]
[null,null,null,null,null,null,null,"100mﾊﾞﾀﾌﾗｲ"]
[null,null,null,null,null,null,null,"200mﾊﾞﾀﾌﾗｲ"]
[null,null,null,null,null,null,null,"200m個人ﾒﾄﾞﾚｰ"]
[null,null,null,null,null,null,null,"400m個人ﾒﾄﾞﾚｰ"]

{"sheet":"学校一覧","index":15,"n_rows":376,"n_cols":17,"rows_kept":376,"cut":false,"hidden":true,"merged":[[3,12,3,14]]}
[1,2,3,4,5,6,7,8,9,10,11,12,13,14,15,16,17]
[null,null,null,null,1,2,3,4,5,6,7,8,9,10,11,12,13]
[]
[null,null,null,null,null,null,null,null,null,null,null,null,"広島市選手権大会"]
[]
["連番","県中連番１","水泳連番","地区名","正　式　学　校　名","登録番号","郵便番号","住　所","電話番号","FAX番号",null,null,"男子","女子","合計"]
[1,1,1,"広島地区　広島市中区","広島市立幟町中学校","34A01","730-0014","広島市中区上幟町6-29","082-221-4421","082-211-3471",null,null,null,null,{"$f":"M7+N7","v":0}]
[2,2,2,null,"広島市立吉島中学校","34A02","730-0822","広島市中区吉島東3-1-1","082-241-3278","082-248-1268",null,null,5,3,{"$f":"M8+N8","v":8}]
[3,3,3,null,"広島市立国泰寺中学校","34A03","730-0042","広島市中区国泰寺1-1-41","082-241-8108","082-240-1379",null,null,null,null,0]
[4,4,4,null,"広島市立江波中学校","34A04","730-0831","広島市中区江波西1-1-13","082-232-1465","082-232-3591",null,null,null,null,0]
[5,5,5,null,"修道中学校",34084,"730-0055","広島市中区南千田西町8-1","082-241-8291","082-249-0870",null,null,null,null,0]
[6,6,6,null,"安田女子中学校","34A06","730-0001","広島市中区白島北町1-41","082-221-3362","082-228-9052",null,null,null,null,0]
[7,7,7,null,"広島女学院中学校","34A07","730-0014","広島市中区上幟町11-32","082-228-4131","082-227-5376",null,null,null,null,0]
[8,8,8,null,"広島県立広島南特別支援学校",null,"730-0822","広島市中区吉島東2-10-33","082-244-0421","082-244-0423",null,null,null,4,4]
[9,null,null,null,"予備",null,null,null,null,null,null,null,null,null,0]
[10,null,null,null,"予備",null,null,null,null,null,null,null,null,null,0]
[11,null,null,null,"予備",null,null,null,null,null,null,null,null,null,0]
[12,17,9,"広島地区　広島市南区","広島市立大州中学校","34A17","732-0802","広島市南区大州5-10-4","082-281-1574","082-288-7074",null,null,null,null,0]
[13,18,10,null,"広島市立段原中学校","34A18","734-0037","広島市南区霞1-3-30","082-281-9171","082-288-7141",null,null,null,null,0]
[14,19,11,null,"広島市立翠町中学校","34A19","734-0005","広島市南区翠4-15-1","082-251-7448","082-252-1408",null,null,null,1,1]
[15,20,12,null,"広島市立仁保中学校","34A20","734-0026","広島市南区仁保1-56-1","082-281-1115","082-581-2174",null,null,null,null,0]
[16,21,13,null,"広島市立楠那中学校","34A21","734-0032","広島市南区楠那町4-1","082-255-0415","082-252-0443",null,null,null,null,0]
[17,22,14,null,"広島市立宇品中学校","34A22","734-0003","広島市南区宇品東5-1-51","082-251-5368","082-252-1680",null,null,null,null,0]
[18,23,15,null,"広島市立似島中学校","34A23","734-0017","広島市南区似島町字南風泊2250番地","082-259-2003","082-259-2183",null,null,null,null,0]
[19,24,16,null,"広島市立似島学園中学校","34A24","734-0017","広島市南区似島町長谷1487","082-259-2311","082-259-1858",null,null,null,null,0]
[20,25,17,null,"広島大学附属中学校","34A25","734-0005","広島市南区翠1-1-1","082-251-0192","082-252-0725",null,null,null,null,0]
[21,26,18,null,"広島大学附属東雲中学校","34A26","734-0022","広島市南区東雲3-1-33","082-890-5222","082-890-5226",null,null,null,null,0]
[22,27,19,null,"比治山女子中学校",34292,"734-0044","広島市南区西霞町5-16","082-251-4478","082-251-5262",null,null,null,null,0]
[23,null,null,null,"予備",null,null,null,null,null,null,null,null,null,0]
[24,null,null,null,"予備",null,null,null,null,null,null,null,null,null,0]
[25,null,null,null,"予備",null,null,null,null,null,null,null,null,null,0]
[26,9,20,"広島地区　広島市東区","広島市立温品中学校","34A09","732-0033","広島市東区温品8-5-1","082-289-1890","082-280-5499",null,null,null,null,0]
[27,10,21,null,"広島市立戸坂中学校","34A10","732-0012","広島市東区戸坂新町3-1-1","082-229-1250","082-229-8265",null,null,null,null,0]
[28,11,22,null,"広島市立牛田中学校","34A11","732-0068","広島市東区牛田新町1-14-1","082-221-9073","082-211-3658",null,null,null,null,0]
[29,12,23,null,"広島市立二葉中学校","34A12","732-0052","広島市東区光町2-15-8","082-262-0396","082-262-3380",null,null,1,null,1]
[30,13,24,null,"広島市立福木中学校","34A13","732-0031","広島市東区馬木9-1-5","082-899-2240","082-899-3384",null,null,null,null,0]
[31,14,25,null,"広島市立早稲田中学校","34A14","732-0062","広島市東区牛田早稲田4-15-1","082-223-2933","082-223-6449",null,null,null,null,0]
[32,15,26,null,"広島城北中学校","34A15","732-0015","広島市東区戸坂城山町1-3","082-229-0111","082-220-2366",null,null,null,3,3]
[33,16,27,null,"広島県立広島中央特別支援学校",null,"732-0009","広島市東区戸坂千足2-1-4","082-229-4134","082-229-4136",null,null,null,null,0]
[34,282,28,"(準加盟）","広島朝鮮中級学校","34A78","732-0048","広島市東区山根町37-50","082-261-0028","082-261-0029",null,null,null,null,0]
[35,null,null,null,"予備",null,null,null,null,null,null,null,null,null,0]
[36,null,null,null,"予備",null,null,null,null,null,null,null,null,null,0]
[37,null,null,null,"予備",null,null,null,null,null,null,null,null,null,0]
[38,65,29,"広島地区　広島市安芸区","広島市立瀬野川中学校","34A63","739-0321","広島市安芸区中野4-24-1","082-893-1265","082-893-1173",null,null,null,null,0]
[39,66,30,null,"広島市立阿戸中学校","34A64","731-4231","広島市安芸区阿戸町2847","082-856-0414","082-856-0395",null,null,null,null,0]
[40,67,31,null,"広島市立船越中学校","34A65","736-0081","広島市安芸区船越6-44-1","082-822-2835","082-822-8309",null,null,null,null,0]
[41,68,32,null,"広島市立矢野中学校","34A66","736-0083","広島市安芸区矢野東2-16-1","082-888-0042","082-888-7542",null,null,null,null,0]
[42,69,33,null,"広島市立瀬野川東中学校","34A67","739-0321","広島市安芸区中野7-29-1","082-894-1601","082-894-3462",null,null,null,null,0]
[43,null,null,null,"予備",null,null,null,null,null,null,null,null,null,0]
[44,null,null,null,"予備",null,null,null,null,null,null,null,null,null,0]
[45,null,null,null,"予備",null,null,null,null,null,null,null,null,null,0]
[46,28,34,"広島地区　広島市西区","広島市立中広中学校","34A28","733-0012","広島市西区中広3-1-41","082-232-2291","082-231-7417",null,null,null,null,0]
[47,29,35,null,"広島市立観音中学校","34A29","733-0815","広島市西区南観音3-4-6","082-232-0458","082-234-0496",null,null,null,null,0]
[48,30,36,null,"広島市立己斐中学校","34A30","733-0815","広島市西区己斐上3-35-1","082-271-2260","082-271-5499",null,null,null,null,0]
[49,31,37,null,"広島市立庚午中学校","34A31","733-0822","広島市西区庚午中4-12-48","082-271-0001","082-271-9944",null,null,null,null,0]
[50,32,38,null,"広島市立井口中学校","34A32","733-0841","広島市西区井口明神2-12-1","082-277-5747","082-279-8057",null,null,null,null,0]
[51,33,39,null,"広島市立古田中学校","34A33","733-0874","広島市西区古江西町27-1","082-271-4661","082-271-4976",null,null,null,null,0]
[52,34,40,null,"広島市立己斐上中学校","34A34","733-0815","広島市西区己斐上6-452-4","082-271-1137","082-271-6433",null,null,null,null,0]
[53,35,41,null,"広島市立井口台中学校","34A35","733-0844","広島市西区井口台4-2-1","082-279-9701","082-279-9702",null,null,null,null,0]
[54,36,42,null,"広島学院中学校","34A36","733-0875","広島市西区古江上1-630","082-271-0241","082-271-6784",null,null,null,null,0]
[55,37,43,null,"崇徳中学校","34A37","733-8511","広島市西区楠木町４-１5-13","082-237-9331","082-230-2897",null,null,null,null,0]
[56,38,44,null,"広島修道大学ひろしま協創中学校学校",34003,"733-8622","広島市西区井口4-6-18","082-278-1101","082-279-8383",null,null,null,null,0]
[57,39,45,null,"ノートルダム清心中学校","34A39","733-0811","広島市西区己斐東1-10-1","082-271-1724","082-272-2596",null,null,null,null,0]
[58,null,null,null,"予備",null,null,null,null,null,null,null,null,null,0]
[59,null,null,null,"予備",null,null,null,null,null,null,null,null,null,0]
[60,null,null,null,"予備",null,null,null,null,null,null,null,null,null,0]
[61,70,46,"広島地区　広島市佐伯区","広島市立三和中学校","34A68","731-5106","広島市佐伯区利松3-10-1","082-928-5808","082-928-4458",null,null,null,null,0]
[62,71,47,null,"広島市立五日市観音中学校","34A69","731-5142","広島市佐伯区坪井3-88","082-921-3851","082-921-9024",null,null,null,null,0]
[63,72,48,null,"広島市立五月が丘中学校","34A70","731-5101","広島市佐伯区五月が丘2-23-1","082-941-0711","082-941-4421",null,null,null,null,0]
[64,73,49,null,"広島市立美鈴が丘中学校","34A71","731-5112","広島市佐伯区美鈴が丘南1-12-1","082-928-2161","082-928-4461",null,null,null,null,0]
[65,74,50,null,"広島市立五日市中学校","34A72","731-5128","広島市佐伯区五日市中央6-4-1","082-921-0148","082-921-0947",null,null,null,null,0]
[66,75,51,null,"広島市立五日市南中学校","34A73","731-5135","広島市佐伯区海老園4-2-21","082-923-5601","082-923-9828",null,null,null,null,{"$f":"M72+N72","v":0}]
[67,76,52,null,"広島市立城山中学校","34A74","731-5155","広島市佐伯区城山2-17-1","082-927-1780","082-927-9244",null,null,null,null,0]
[68,77,53,null,"広島市立湯来中学校","34A75","738-0601","広島市佐伯区湯来町和田118-1","0829-83-0547","0829-83-0205",null,null,null,null,0]
[69,78,54,null,"広島市立砂谷中学校","34A76","738-0513","広島市佐伯区湯来町伏谷5-1","0829-86-0554","0829-86-0524",null,null,null,null,0]
[70,79,55,null,"広島なぎさ中学校","34A77","731-5143","広島市佐伯区三宅1-6-25","082-921-2137","082-924-3020",null,null,null,null,0]
[71,null,null,null,"予備",null,null,null,null,null,null,null,null,null,0]
[72,null,null,null,"予備",null,null,null,null,null,null,null,null,null,0]
[73,null,null,null,"予備",null,null,null,null,null,null,null,null,null,0]
[74,40,56,"広島地区　広島市安佐南区","広島市立城南中学校","34A40","731-0102","広島市安佐南区川内6-8-1","082-877-3209","082-870-6309",null,null,null,null,0]
[75,41,57,null,"広島市立安佐中学校",34108,"731-0124","広島市安佐南区大町東4-1-6","082-877-0111","082-870-6355",null,null,null,null,0]
[76,42,58,null,"広島市立安西中学校","34A42","731-0142","広島市安佐南区高取南3-27-1","082-878-4441","082-872-9691",null,null,null,null,0]
[77,43,59,null,"広島市立祇園中学校","34A43","731-0138","広島市安佐南区祇園5-39-1","082-874-0055","082-874-6405",null,null,null,null,0]
[78,44,60,null,"広島市立祇園東中学校","34A44","731-0113","広島市安佐南区西原7-16-1","082-874-6262","082-874-4044",null,null,null,null,0]
[79,45,61,null,"広島市立戸山中学校","34A45","731-3271","広島市安佐南区沼田町阿戸3725","082-839-2014","082-839-3308",null,null,null,null,0]
[80,46,62,null,"広島市立伴中学校","34A46","731-3161","広島市安佐南区沼田町伴3759","082-848-0017","082-848-9544",null,null,null,null,0]
[81,47,63,null,"広島市立安佐南中学校","34A47","731-0125","広島市安佐南区大町西2-35-1","082-879-9358","082-870-1617",null,null,null,null,0]
[82,48,64,null,"広島市立長束中学校","34A48","731-0136","広島市安佐南区長束西1-26-2","082-239-3883","082-239-3518",null,null,null,null,0]
[83,49,65,null,"広島市立高取北中学校","34A49","731-0144","広島市安佐南区高取北3-19-1","082-872-2071","082-872-9702",null,null,null,null,0]
[84,50,66,null,"広島市立城山北中学校","34A50","731-0101","広島市安佐南区八木5-34-1","082-873-5506","082-873-5507",null,null,null,null,0]
[85,51,67,null,"広島市立東原中学校","34A51","731-0112","広島市安佐南区東原3-8-1","082-875-6181","082-875-3992",null,null,null,null,0]
[86,52,68,null,"広島市立大塚中学校","34A94","731-3167","広島市安佐南区大塚西6-3-1","082-849-1022","082-849-1033",null,null,null,null,0]
[87,53,69,null,"AICJ中学校","34A95","731-0138","広島市安佐南区祇園2-33-6","082-832-5037","082-875-5364",null,null,null,null,0]
[88,null,null,null,"予備",null,null,null,null,null,null,null,null,null,0]
[89,null,null,null,"予備",null,null,null,null,null,null,null,null,null,0]
[90,null,null,null,"予備",null,null,null,null,null,null,null,null,null,0]
[91,54,70,"広島地区　広島市安佐北区","広島市立白木中学校","34A52","739-1411","広島市安佐北区白木町市川1428","082-828-0525","082-828-0501",null,null,null,null,0]
[92,55,71,null,"広島市立高陽中学校","34A53","739-1751","広島市安佐北区深川6-22-6","082-842-0022","082-842-9727",null,null,null,null,0]
[93,56,72,null,"広島市立落合中学校","34A54","739-1741","広島市安佐北区真亀2-1-1","082-842-6416","082-842-9806",null,null,null,null,0]
[94,57,73,null,"広島市立可部中学校","34A55","731-0221","広島市安佐北区可部7-2-1","082-814-2224","082-814-0914",null,null,null,null,0]
[95,58,74,null,"広島市立亀山中学校","34A56","731-0232","広島市安佐北区亀山南3-28-1","082-814-8834","082-815-9634",null,null,null,null,0]
[96,59,75,null,"広島市立清和中学校","34A57","731-1142","広島市安佐北区安佐町大字飯室3737","082-835-0006","082-835-3049",null,null,null,null,0]
[97,60,76,null,"広島市立日浦中学校","34A58","731-3361","広島市安佐北区安佐町あさひが丘1455","082-838-2011","082-838-3893",null,null,null,null,0]
[98,61,77,null,"広島市立亀崎中学校","34A59","739-1742","広島市安佐北区亀崎4-1-1","082-843-5792","082-843-7992",null,null,null,null,0]
[99,62,78,null,"広島市立三入中学校","34A60","731-0212","広島市安佐北区三入東1-7-1","082-818-0301","082-818-3951",null,null,null,null,0]
[100,63,79,null,"広島市立口田中学校","34A61","739-1733","広島市安佐北区口田南9-13-1","082-843-9511","082-843-8536",null,null,null,null,0]
[101,64,80,null,"広島市立安佐北中学校","34A62","732-0212","広島市安佐北区三入東1-14-1","082-818-0600","082-818-5140",null,null,null,null,0]
[102,null,null,null,"予備",null,null,null,null,null,null,null,null,null,0]
[103,null,null,null,"予備",null,null,null,null,null,null,null,null,null,0]
[104,null,null,null,"予備",null,null,null,null,null,null,null,null,null,0]
[105,80,81,"広島地区　大竹市・廿日市市","廿日市市立廿日市中学校","34A79","738-0004","廿日市市桜尾3-9-1","0829-32-3191","0829-32-3319",null,null,null,null,0]
[106,81,82,null,"廿日市市立七尾中学校","34A80","738-0025","廿日市市平良2-2-34","0829-32-8200","0829-32-8285",null,null,null,null,0]
[107,82,83,null,"廿日市市立阿品台中学校","34A81","738-0052","廿日市市阿品台東1-1","0829-39-1516","0829-39-1914",null,null,null,null,0]
[108,83,84,null,"廿日市市立野坂中学校","34A82","738-0043","廿日市市地御前北1-3-1","0829-38-2001","0829-38-2569",null,null,null,null,0]
[109,84,85,null,"廿日市市立四季が丘中学校","34A83","738-0036","廿日市市四季が丘2-1-1","0829-38-3371","0829-38-3394",null,null,null,null,0]
[110,85,86,null,"廿日市市立佐伯中学校","34A84","738-0222","廿日市市津田69-1","0829-72-1145","0829-72-1146",null,null,null,null,0]
[111,86,87,null,"廿日市市立吉和中学校","34A85","738-0301","廿日市市吉和1413","0829-77-2019","0829-77-2019",null,null,null,null,0]
[112,87,88,null,"廿日市立大野中学校","34A91","739-0441","廿日市市大野原4-2-60","0829-55-2015","0829-54-0475",null,null,null,null,0]
[113,88,89,null,"廿日市立大野東中学校","34A92","739-0406","廿日市市大野414","0829-56-2177","0829-56-4653",null,null,null,null,0]
[114,89,90,null,"廿日市立宮島中学校","34A93","739-0505","廿日市市宮島町779","0829-44-2015","0829-44-2157",null,null,null,null,0]
[115,90,91,null,"山陽女学園中等部","34A86","738-0003","廿日市市佐方本町１－１","0829-32-2222","0829-32-7683",null,null,null,null,0]
[116,91,92,null,"大竹市立玖波中学校","34A87","739-0651","大竹市玖波4-12-1","0827-57-7241","0827-57-3060",null,null,null,null,0]
[117,92,93,null,"大竹市立小方中学校","34A88","739-0623","大竹市小方1-9-1","0827-57-7211","0827-57-7208",null,null,null,null,0]
[118,93,94,null,"大竹市立大竹中学校","34A89","739-0614","大竹市白石1-8-1","0827-52-5177","0827-52-5178",null,null,null,null,0]
[119,94,95,null,"大竹市立栗谷中学校","34A90","739-0645","大竹市栗谷町小栗林901","0827-56-0263","0827-56-0263",null,null,null,null,0]
[120,null,null,null,"予備",null,null,null,null,null,null,null,null,null,0]
[121,null,null,null,"予備",null,null,null,null,null,null,null,null,null,0]
[122,null,null,null,"予備",null,null,null,null,null,null,null,null,null,0]
[123,95,96,"芸北地区　山県郡","安芸太田町立加計中学校",null,"731-3501","山県郡安芸太田町大字加計5097","0826-22-0108","0826-22-2926",null,null,null,null,0]
[124,96,97,null,"安芸太田町立筒賀中学校",null,"731-3701","山県郡安芸太田町大字上筒賀172","0826-32-2244","0826-32-2987",null,null,null,null,0]
[125,97,98,null,"安芸太田町立戸河内中学校",null,"731-3821","山県郡安芸太田町大字土居428","0826-28-2105","0826-28-2145",null,null,null,null,0]
[126,98,99,null,"北広島町立芸北中学校",null,"731-2323","山県郡北広島町川小田75-1","0826-35-0151","0826-35-0409",null,null,null,null,0]
[127,99,100,null,"北広島町立豊平中学校",null,"731-1712","山県郡北広島町都志見914","0826-83-0160","0826-85-0130",null,null,null,null,0]
[128,100,101,null,"北広島町立大朝中学校",null,"731-2104","山県郡北広島町大朝4683-1","0826-82-2037","0826-82-2103",null,null,null,null,0]
[129,101,102,null,"北広島町立千代田中学校",null,"731-1532","山県郡北広島町古保利450","0826-72-3101","0826-72-3873",null,null,null,null,0]
[130,102,103,null,"広島新庄中学校",null,"731-2198","山県郡北広島町新庄848","0826-82-2323","0826-82-3273",null,null,null,null,{"$f":"M136+N136","v":0}]
[131,null,null,null,"予備",null,null,null,null,null,null,null,null,null,0]
[132,null,null,null,"予備",null,null,null,null,null,null,null,null,null,0]
[133,null,null,null,"予備",null,null,null,null,null,null,null,null,null,0]
[134,103,104,"芸北地区　安芸高田市","安芸高田市立吉田中学校",null,"731-0521","安芸高田市吉田町大字常友1018-1","0826-42-0400","0826-42-1544",null,null,null,null,0]
[135,104,105,null,"安芸高田市立八千代中学校",null,"731-0303","安芸高田市八千代町佐々井1438-1","0826-52-2007","0826-52-3885",null,null,null,null,0]
[136,105,106,null,"安芸高田市立美土里中学校",null,"731-0612","安芸高田市美土里町本郷1214-5","0826-54-0142","0826-54-0291",null,null,null,null,0]
[137,106,107,null,"安芸高田市立高宮中学校",null,"739-1802","安芸高田市高宮町佐々部38-2","0826-57-0050","0826-57-0050",null,null,null,null,0]
[138,107,108,null,"安芸高田市立甲田中学校",null,"739-1101","安芸高田市甲田町高田原1250","0826-45-2003","0826-45-4793",null,null,null,null,0]
[139,108,109,null,"安芸高田市立向原中学校",null,"739-1201","安芸高田市向原町大字坂236-1","0826-46-2049","0826-46-4043",null,null,null,null,0]
[140,null,null,null,"予備",null,null,null,null,null,null,null,null,null,0]
[141,null,null,null,"予備",null,null,null,null,null,null,null,null,null,0]
[142,null,null,null,"予備",null,null,null,null,null,null,null,null,null,0]
[143,109,110,"呉・賀茂地区　呉市","呉市立仁方中学校","34C01","737-0154","呉市仁方桟橋通16-8","0823-79-1177","0823-79-6929",null,null,null,null,0]
[144,110,111,null,"呉市立広南中学校","34C02","737-0136","呉市広長浜4-1-9","0823-71-7920","0823-74-3502",null,null,null,null,0]
[145,111,112,null,"呉市立白岳中学校","34C03","737-0142","呉市広駅前2-11-1","0823-74-2121","0823-74-3503",null,null,null,null,0]
[146,112,113,null,"呉市立広中央中学校","34C04","737-0121","呉市広吉松2-15-1","0823-71-8524","0823-74-3504",null,null,null,null,0]
[147,113,114,null,"呉市立郷原中学校","34C05","737-0161","呉市郷原町11706-2","0823-77-0014","0823-77-0065",null,null,null,null,0]
[148,114,115,null,"呉市立横路中学校","34C06","737-0113","呉市広横路4-9-15","0823-71-7827","0823-74-3505",null,null,null,null,0]
[149,115,116,null,"呉市立阿賀中学校","34C07","737-0003","呉市阿賀中央5-14-16","0823-71-3304","0823-74-3506",null,null,null,null,0]
[150,116,117,null,"呉市立大冠中学校（休校）",null,null,null,null,null,null,null,null,null,0]
[151,117,118,null,"呉市立警固屋中学校","34C09","737-0012","呉市警固屋7-4-1","0823-28-0914","0823-28-2985",null,null,null,null,0]
[152,118,119,null,"呉市立宮原中学校","34C10","737-0015","呉市船見1-1","0823-21-1468","0823-24-9814",null,null,null,null,0]
[153,119,120,null,"呉市立和庄中学校","34C11","737-0043","呉市和庄登町3-18","0823-21-6631","0823-24-9845",null,null,null,null,0]
[154,120,121,null,"呉市立東畑中学校","34C12","737-0072","呉市東畑2-7-38","0823-21-6210","0823-24-9846",null,null,null,null,0]
[155,121,122,null,"呉市立片山中学校","34C13","737-0805","呉市東片山町13-5","0823-21-4995","0823-24-9847",null,null,null,null,0]
[156,122,123,null,"呉市立呉中央中学校","34C14","737-0811","呉市西中央4-10-52","0823-21-2828","0823-24-9848",null,null,null,null,0]
[157,123,124,null,"呉市立両城中学校","34C15","737-0826","呉市両城2-22-15","0823-21-4661","0823-24-9849",null,null,null,null,0]
[158,124,125,null,"呉市立吉浦中学校","34C16","737-0862","呉市狩留賀町8-6","0823-31-7570","0823-31-2837",null,null,null,null,0]
[159,125,126,null,"呉市立天応中学校","34C17","737-0882","呉市天応東久保2-7-1","0823-38-7545","0823-38-8334",null,null,null,null,0]
[160,126,127,null,"呉市立昭和中学校","34C18","737-0935","呉市焼山中央6-9-1","0823-33-0311","0823-34-2127",null,null,null,null,0]
[161,127,128,null,"呉市立昭和北中学校","34C19","737-0913","呉市焼山泉ヶ丘2-11-1","0823-33-9610","0823-34-2128",null,null,null,null,0]
[162,128,129,null,"呉青山中学校","34C20","737-0023","呉市青山町2-1","0823-23-1520","0823-23-6171",null,null,null,null,0]
[163,129,130,null,"呉市立下蒲刈中学校","34C21","737-0300","呉市下蒲刈町2119","0823-65-2024","0823-65-2024",null,null,null,null,0]
[164,130,131,null,"呉市立川尻中学校","34C22","729-2603","呉市川尻町西1-23-47","0823-87-2072","0823-87-2507",null,null,null,null,0]
[165,131,132,null,"呉市立安浦中学校","34C23","729-2502","呉市安浦町三津口1-75","0823-84-5151","0823-84-5152",null,null,null,null,0]
[166,132,133,null,"呉市立豊浜中学校","34C24","734-0101","呉市豊浜町豊島3438-2","08466-8-2009","08466-8-2909",null,null,null,null,0]
[167,133,134,null,"呉市立豊中学校","34C25","734-0301","呉市豊町大長6382-1","08466-6-2252","08466-6-3811",null,null,null,null,0]
[168,134,135,null,"呉市立音戸中学校","34C26","737-1205","呉市音戸町南隠渡4-15-1","0823-51-2731","0823-52-1505",null,null,null,null,0]
[169,135,136,null,"呉市立明徳中学校","34C27","737-1214","呉市音戸町藤脇1-30-1","0823-56-0303","0823-56-0309",null,null,null,null,0]
[170,136,137,null,"呉市立倉橋中学校","34C28","737-1377","呉市倉橋町383-2","0823-53-0019","0823-53-0021",null,null,null,null,0]
[171,137,138,null,"呉市立蒲刈中学校","34C30","737-0311","呉市蒲刈町向771","0823-68-0020","0823-70-9030",null,null,null,null,0]
[172,null,null,null,"予備",null,null,null,null,null,null,null,null,null,0]
[173,null,null,null,"予備",null,null,null,null,null,null,null,null,null,0]
[174,null,null,null,"予備",null,null,null,null,null,null,null,null,null,0]
[175,138,139,"呉・賀茂地区　安芸郡","府中町立府中中学校","34C31","735-0005","安芸郡府中町宮の町5-4-28","082-282-3181","082-282-3182",null,null,null,null,0]
[176,139,140,null,"府中町立府中緑ヶ丘中学校","34C32","735-0024","安芸郡府中町緑ヶ丘3-18","082-283-4701","082-283-4707",null,null,null,null,0]
[177,140,141,null,"海田町立海田中学校","34C33","736-0026","安芸郡海田町幸町10-1","082-822-2258","082-823-8505",null,null,null,null,0]
[178,141,142,null,"海田町立海田西中学校","34C34","736-0052","安芸郡海田町南つくも町2-2","082-823-8551","082-822-3165",null,null,null,null,0]
[179,142,143,null,"熊野町立熊野中学校","34C35","731-4214","安芸郡熊野町1827","082-854-0109","082-855-2485",null,null,null,null,0]
[180,143,144,null,"熊野町立熊野東中学校","34C36","731-4213","安芸郡熊野町4466","082-854-7111","082-855-2486",null,null,null,null,0]
[181,144,145,null,"坂町立坂中学校","34C37","731-4323","安芸郡坂町横浜中央1-6-57","082-885-0004","082-885-1115",null,null,null,null,0]
[182,null,null,null,"予備",null,null,null,null,null,null,null,null,null,0]
[183,null,null,null,"予備",null,null,null,null,null,null,null,null,null,0]
[184,null,null,null,"予備",null,null,null,null,null,null,null,null,null,0]
[185,145,146,"呉・賀茂地区　江田島市","江田島市立江田島中学校","34C39","737-2122","江田島市江田島町小用1-13-1","0823-42-1177","0823-42-1178",null,null,null,null,0]
[186,146,147,null,"江田島市立能美中学校","34C40","737-2301","江田島市能美町中町3721-1","0823-45-2212","0823-45-2396",null,null,null,null,0]
[187,147,148,null,"江田島市立三高中学校","34C41","737-2316","江田島市沖美町三吉2699","0823-47-0125","0823-47-0126",null,null,null,null,0]
[188,148,149,null,"江田島市立大柿中学校","34C43","737-2213","江田島市大柿町大原920","0823-57-2065","0823-57-2146",null,null,null,null,0]
[189,null,null,null,"予備",null,null,null,null,null,null,null,null,null,0]
[190,null,null,null,"予備",null,null,null,null,null,null,null,null,null,0]
[191,null,null,null,"予備",null,null,null,null,null,null,null,null,null,0]
[192,149,150,"呉・賀茂地区　東広島市","東広島市立西条中学校","34C44","739-0041","東広島市西条町大字寺家6466","082-423-2529","082-423-2571",null,null,null,null,0]
[193,150,151,null,"東広島市立向陽中学校","34C45","739-0034","東広島市西条町大字大沢25-2","082-425-0007","082-425-0009",null,null,null,null,0]
[194,151,152,null,"東広島市立八本松中学校","34C46","739-0144","東広島市八本松南2-2-1","082-428-0202","082-428-0279",null,null,null,null,{"$f":"M200+N200","v":0}]
[195,152,153,null,"東広島市立志和中学校",null,"739-0268","東広島市志和町大字志和西1432","082-433-2019","082-433-2089",null,null,null,null,0]
[196,153,154,null,"東広島市立高屋中学校","34C48","739-2125","東広島市高屋町中島760","082-434-0011","082-434-0041",null,null,null,null,0]
[197,154,155,null,"東広島市立磯松中学校","34C49","739-0132","東広島市八本松町正力666-1","082-428-6675","082-428-6676",null,null,null,null,0]
[198,155,156,null,"東広島市立松賀中学校","34C50","739-0024","東広島市西条町御薗字860","082-422-6277","082-422-6282",null,null,null,null,0]
[199,156,157,null,"東広島市立高美が丘中学校","34C51","739-2115","東広島市高屋高美が丘1-1-1","082-434-0026","082-434-2835",null,null,null,null,0]
[200,157,158,null,"東広島市立黒瀬中学校","34C52","724-0612","東広島市黒瀬町丸山82-1","0823-82-2039","0823-82-2189",null,null,null,null,0]
[201,158,159,null,"東広島市立福富中学校","34C53","724-0202","東広島市福富町下竹仁2096－3","0824-35-2341","0824-35-2036",null,null,null,null,0]
[202,159,160,null,"東広島市立豊栄中学校","34C54","724-0307","東広島市豊栄町鍛冶屋341-1","0824-32-2351","0824-32-4540",null,null,null,null,0]
[203,160,161,null,"東広島市立河内中学校","34C55","729-1101","東広島市河内町中河内1757-1","0824-37-1128","0824-37-2273",null,null,null,null,0]
[204,161,162,null,"東広島市立安芸津中学校","34C56","729-2402","東広島市安芸津町三津5563－8","0846-45-0158","0846-45-5985",null,null,null,null,0]
[205,162,163,null,"東広島市立中央中学校","34C60","739-0044","東広島市西条町下見4281番地1","082-431-5055","082-431-5077",null,null,null,null,0]
[206,163,164,null,"武田中学校","34C57","724-0611","東広島市黒瀬町字大多田443-5","0823-82-2331","0823-82-2457",null,null,null,null,0]
[207,164,165,null,"近畿大学附属東広島中学校","34C58","739-2116","東広島市高屋うめの辺２番","0824-34-7111","0824-34-7110",null,null,null,null,0]
[208,165,166,null,"広島県立広島中学校","34C59","739-2125","東広島市高屋町中島31-7","082-491-0270","082-434-7023",null,null,null,null,0]
[209,null,null,null,"予備",null,null,null,null,null,null,null,null,null,0]
[210,null,null,null,"予備",null,null,null,null,null,null,null,null,null,0]
[211,null,null,null,"予備",null,null,null,null,null,null,null,null,null,0]
[212,166,167,"南部地区　尾道市","尾道市立久保中学校","34D01","722-0041","尾道市防地町22-40","0848-37-3961","0848-37-3962",null,null,null,null,0]
[213,167,168,null,"尾道市立長江中学校","34D02","722-0046","尾道市長江3-10-4","0848-37-3971","0848-37-3970",null,null,null,null,0]
[214,168,169,null,"尾道市立栗原中学校","34D03","722-0023","尾道市東則末町9-53","0848-23-3811","0848-23-3812",null,null,null,null,0]
[215,169,170,null,"尾道市立吉和中学校","34D04","722-0008","尾道市吉和町4600","0848-23-3821","0848-23-3822",null,null,null,null,0]
[216,170,171,null,"尾道市立日比崎中学校","34D05","722-0013","尾道市日比崎町23-1","0848-22-6513","0848-22-2002",null,null,null,null,0]
[217,171,172,null,"尾道市立美木中学校","34D06","722-0212","尾道市美ノ郷町本郷2258","0848-48-0515","0848-48-5060",null,null,null,null,0]
[218,172,173,null,"尾道市立原田中学校","34D07","722-0202","尾道市原田町梶山田66","0848-38-0239","0848-38-0461",null,null,null,null,0]
[219,173,174,null,"尾道市立高西中学校","34D08","729-0141","尾道市高須町3467-1","0848-46-0205","0848-46-6131",null,null,null,null,0]
[220,174,175,null,"尾道市立百島中学校","34D09","722-0061","尾道市百島町489","0848-73-2709","0848-73-5106",null,null,null,null,0]
[221,175,176,null,"尾道市立浦崎中学校","34D10","720-0551","尾道市浦崎町2842","0848-73-2009","0848-73-5234",null,null,null,null,0]
[222,176,177,null,"尾道市立向東中学校","34D11","722-0062","尾道市向東町8885-21","0848-44-3016","0848-44-3017",null,null,null,null,0]
[223,177,178,null,"尾道市立御調中学校","34D12","722-0353","尾道市御調町高尾93","0848-76-0069","08487-6-0069",null,null,null,null,0]
[224,178,179,null,"尾道市立向島中学校","34D13","722-0073","尾道市向島町16058-20","0848-44-0416","0848-44-1144",null,null,null,null,0]
[225,179,180,null,"尾道市立因島南中学校","34D28","722-2323","尾道市因島土生町1172-1","0845-26-0373",null,null,null,null,null,0]
[226,180,181,null,"尾道市立因北中学校","34D30","722-2211","尾道市因島中庄町4405-1","0845-24-0029","0845-24-0061",null,null,null,null,0]
[227,181,182,null,"尾道市立重井中学校","34D31","722-2102","尾道市因島重井町651-2","0845-25-0012","0845-25-0012",null,null,null,null,0]
[228,182,183,null,"尾道市立瀬戸田中学校","34D36","722-2415","尾道市瀬戸田町中野404-3","0845-27-0014","0845-27-3954",null,null,null,null,0]
[229,183,184,null,"尾道中学校","34D45","722-0022","尾道市栗原町1268-1","0848-23-2313","0848-24-2091",null,null,null,null,0]
[230,184,185,null,"広島県立尾道特別支援学校","34D14","722-0022","尾道市栗原町1524","0848-22-5248","0848-22-5249",null,null,null,null,0]
[231,null,null,null,"予備",null,null,null,null,null,null,null,null,null,0]
[232,null,null,null,"予備",null,null,null,null,null,null,null,null,null,0]
[233,null,null,null,"予備",null,null,null,null,null,null,null,null,null,0]
[234,185,186,"南部地区　三原市","三原市立第一中学校","34D15","729-0324","三原市糸崎町2165","0848-62-3211","0848-62-9246",null,null,null,null,0]
[235,186,187,null,"三原市立第二中学校","34D16","723-0003","三原市中之町3510","0848-62-3212","0848-67-5984",null,null,null,null,0]
[236,187,188,null,"三原市立第三中学校","34D17","723-0016","三原市宮沖3-15-2","0848-62-3213","0848-67-6498",null,null,null,null,0]
[237,188,189,null,"三原市立第四中学校","34D18","723-0032","三原市須波西町680-4","0848-69-2594","0848-69-3262",null,null,null,null,0]
[238,189,190,null,"三原市立第五中学校","34D19","723-0145","三原市沼田東町片島532","0848-66-0215","0848-66-1609",null,null,null,null,0]
[239,190,191,null,"三原市立幸崎中学校","34D20","729-2252","三原市幸崎町能地3002","0848-69-0004","0848-69-3257",null,null,null,null,0]
[240,191,192,null,"三原市立宮浦中学校","34D22","723-0051","三原市宮浦5-29-1","0848-64-1591","0848-64-6362",null,null,null,null,0]
[241,192,193,null,"三原市立本郷中学校","34D23","729-0414","三原市本郷町下北方1195","0848-86-2030","0848-86-3592",null,null,null,null,0]
[242,193,194,null,"三原市立久井中学校","34D24","722-1303","三原市久井町下津735","0847-32-6019","0847-32-6019",null,null,null,null,0]
[243,194,195,null,"三原市立大和中学校","34D25","729-1323","三原市大和町大具2280","0847-34-1111","0847-34-1112",null,null,null,null,0]
[244,195,196,null,"広島大学附属三原中学校","34D26","723-0004","三原市館町2-6-1","0848-62-4777","0848-60-0121",null,null,null,null,0]
[245,196,197,null,"如水館中学校","34D27","723-8501","三原市深町1183番地","0848-63-2454","0848-63-2512",null,null,null,null,0]
[246,null,null,null,"予備",null,null,null,null,null,null,null,null,null,0]
[247,null,null,null,"予備",null,null,null,null,null,null,null,null,null,0]
[248,null,null,null,"予備",null,null,null,null,null,null,null,null,null,0]
[249,197,198,"南部地区　豊田・竹原","大崎上島町立大崎中学校","34D33","725-0301","豊田郡大崎上島町中野5603","08466-4-2055","08466-4-3999",null,null,null,null,0]
[250,198,199,null,"竹原市立忠海中学校","34D38","729-2317","竹原市忠海東町3-9-1","0846-26-0929","0846-26-0951",null,null,null,null,0]
[251,199,200,null,"竹原市立竹原中学校","34D39","725-0012","竹原市下野町2230","0846-22-2045","0846-22-2507",null,null,null,null,0]
[252,200,201,null,"竹原市立賀茂川中学校","34D40","725-0004","竹原市東野町2051-1","0846-29-0200","0846-29-0216",null,null,null,null,0]
[253,201,202,null,"竹原市立吉名中学校","34D41","725-0013","竹原市吉名町2671","0846-28-0205","0846-28-0237",null,null,null,null,0]
[254,null,null,null,"予備",null,null,null,null,null,null,null,null,null,0]
[255,null,null,null,"予備",null,null,null,null,null,null,null,null,null,0]
[256,null,null,null,"予備",null,null,null,null,null,null,null,null,null,0]
[257,202,203,"南部地区　　世羅郡","世羅町立甲山中学校","34D42","722-1121","世羅郡世羅町西上原1469-1","0847-22-0037","0847-22-2049",null,null,null,null,0]
[258,203,204,null,"世羅町立世羅中学校","34D43","722-1111","世羅郡世羅町寺町961-2","0847-22-2323","0847-22-2324",null,null,null,null,{"$f":"M264+N264","v":0}]
[259,204,205,null,"世羅町立世羅西中学校","34D44","729-6711","世羅郡世羅町黒川144-4","0847-37-1122","0847-37-1029",null,null,null,null,0]
[260,206,206,null,"福山市立城北中学校","34F02","720-0082","福山市木之庄町4-1-1","084-923-0668","084-923-0698",null,null,null,null,0]
[261,208,207,null,"福山市立鷹取中学校","34F04","720-0831","福山市草戸町4-4-1","084-923-0603","084-923-0601",null,null,null,null,0]
[262,210,208,null,"福山市立幸千中学校","34F06","720-0004","福山市御幸町中津原1270","084-955-0121","084-955-2492",null,null,null,null,0]
[263,211,209,null,"福山市立済美中学校","34F07","720-0843","福山市赤坂町赤坂267-2","084-951-1009","084-951-6928",null,null,null,null,0]
[264,212,210,null,"福山市立向丘中学校","34F08","720-0833","福山市水呑向丘107","084-956-0056","084-956-0983",null,null,null,null,0]
[265,213,211,null,"福山市立鞆中学校","34F09","720-0202","福山市鞆町後地371-1","084-982-1717","084-982-1710",null,null,null,null,0]
[266,214,212,null,"福山市立走島中学校","34F10","720-0204","福山市走島町58","084-984-2004","084-984-2274",null,null,null,null,0]
[267,217,213,null,"福山市立大成館中学校","34F13","729-0112","福山市神村町4","084-934-1066","084-934-9523",null,null,null,null,0]
[268,218,214,null,"福山市立松永中学校","34F14","729-0104","福山市松永町49-1","084-934-3117","084-934-9531",null,null,null,null,0]
[269,219,215,null,"福山市立精華中学校","34F15","720-0541","福山市金江町金見1921","084-935-7253","084-935-9021",null,null,null,null,0]
[270,221,216,null,"福山市立芦田中学校","34F17","720-1262","福山市芦田町下有地928","084-958-2031","084-958-4725",null,null,null,null,0]
[271,222,217,null,"福山市立山野中学校","34F18","720-2602","福山市山野町山野3766","084-974-2012","084-974-2613",null,null,null,null,0]
[272,223,218,null,"福山市立広瀬中学校","34F19","720-2411","福山市加茂町北山1064-1","084-972-2210","084-972-7094",null,null,null,null,0]
[273,224,219,null,"福山市立加茂中学校","34F20","720-2412","福山市加茂町下加茂1190","084-972-2065","084-972-7097",null,null,null,null,0]
[274,225,220,null,"福山市立駅家中学校","34F21","720-2413","福山市駅家町法成寺250","084-976-2051","084-976-6347",null,null,null,null,0]
[275,227,221,null,"福山市立城西中学校","34F23","720-0092","福山市山手町3000","084-952-1257","084-952-2246",null,null,null,null,0]
[276,231,222,null,"福山市立駅家南中学校","34F27","720-1141","福山市駅家町江良247","084-976-0885","084-976-6374",null,null,null,null,0]
[277,232,223,null,"福山市立内海中学校","34F28","722-2632","福山市内海町口933","084-986-2005","084-980-9065",null,null,null,null,0]
[278,233,224,null,"福山市立常金中学校","34F29","729-3111","福山市新市町金丸414","0847-53-8122","0847-40-4003",null,null,null,null,0]
[279,234,225,null,"福山市立新市中央中学校","34F30","729-3103","福山市新市町新市1305","0847-52-5534","0847-52-5537",null,null,null,null,0]
[280,235,226,null,"福山市立福山中学校","34F31","720-0832","福山市赤坂町大字赤坂910","084-951-5978","084-951-6518",null,null,null,null,0]
[281,236,227,null,"福山市立千年中学校","34F32","720-0311","福山市沼隈町草深2058-2","084-987-0025","084-987-0025",null,null,null,null,0]
[282,237,228,null,"福山市立至誠中学校","34F33","720-0401","福山市沼隈町上山南484-2","084-988-0614","084-988-0614",null,null,null,null,0]
[283,242,229,null,"近畿大学附属福山中学校","34F35","720-0835","福山市佐波町389","084-951-2695","084-951-3581",null,null,null,null,0]
[284,null,null,null,"予備",null,null,null,null,null,null,null,null,null,0]
[285,null,null,null,"予備",null,null,null,null,null,null,null,null,null,0]
[286,null,null,null,"予備",null,null,null,null,null,null,null,null,null,0]
[287,205,230,"福山地区　福山市","福山市立東中学校","34F01","720-0032","福山市三吉町南2-10-2","084-923-1765","084-923-1762",null,null,null,null,0]
[288,207,231,null,"福山市立城南中学校","34F03","720-0814","福山市光南町3-4-1","084-922-1553","084-922-1554",null,null,null,null,0]
[289,209,232,null,"福山市立城東中学校","34F05","721-0974","福山市東深津町3-17-33","084-923-1607","084-923-1671",null,null,null,null,0]
[290,215,233,null,"福山市立鳳中学校","34F11","721-0915","福山市伊勢丘6-5-1","084-947-1022","084-947-9262",null,null,null,null,0]
[291,216,234,null,"福山市立培遠中学校","34F12","721-0907","福山市春日町3-15-18","084-947-1103","084-947-9272",null,null,null,null,0]
[292,220,235,null,"福山市立中央中学校","34F16","721-0975","福山市西深津町5-22-1","084-925-0036","084-925-0052",null,null,null,null,0]
[293,226,236,null,"福山市立誠之中学校","34F22","721-0955","福山市新涯町6-14-1","084-953-0939","084-953-0982",null,null,null,null,0]
[294,228,237,null,"福山市立大門中学校","34F24","721-0929","福山市城興ヶ丘8-1","084-941-7221","084-941-7215",null,null,null,null,0]
[295,229,238,null,"福山市立一ツ橋中学校","34F25","721-0962","福山市東手城町1-4-1","084-941-7335","084-941-7365",null,null,null,null,0]
[296,230,239,null,"福山市立東朋中学校","34F26","721-0913","福山市幕山台7-24-1","084-947-4005","084-947-9294",null,null,null,null,0]
[297,238,240,null,"福山市立神辺中学校","34F40","720-2121","福山市神辺町湯野1313","084-962-0400","084-962-0339",null,null,null,null,0]
[298,239,241,null,"福山市立神辺東中学校","34F41","720-2115","福山市神辺町下竹田959-1","084-965-1001","084-965-1002",null,null,null,null,0]
[299,240,242,null,"福山市立神辺西中学校","34F42","720-2123","福山市神辺町川北1401-1","084-963-3400","084-963-3412",null,null,null,null,0]
[300,241,243,null,"広島大学附属福山中学校","34F34","721-8551","福山市春日町5-14-1","084-941-8350","084-941-8356",null,null,null,null,0]
[301,243,244,null,"福山暁の星女子中学校","34F36","721-8545","福山市西深津町3-4-1","084-922-1682","084-925-1533",null,null,null,null,0]
[302,244,245,null,"盈進中学校","34F37","720-8504","福山市千田町千田487-4","084-955-2333","084-955-4423",null,null,null,null,0]
[303,245,246,null,"銀河学院中学校","34F38","721-0921","福山市大門町大門119-8","084-941-9292","084-941-7142",null,null,null,null,0]
[304,246,247,null,"英数学館中学校","34F39","721-0942","福山市引野町980-1","084-941-4116","084-941-4118",null,null,null,null,0]
[305,null,null,null,"予備",null,null,null,null,null,null,null,null,null,0]
[306,null,null,null,"予備",null,null,null,null,null,null,null,null,null,0]
[307,null,null,null,"予備",null,null,null,null,null,null,null,null,null,0]
[308,247,248,"福山地区　府中市","府中市立第一中学校","34F43","726-0022","府中市用土町463","0847-41-2394","0847-41-2364",null,null,null,null,0]
[309,248,249,null,"府中市立府中中学校","34F44","726-0003","府中市元町576-1","0847-41-2131","0847-41-2374",null,null,null,null,0]
[310,249,250,null,"府中市立府中明郷中学校","34F45","726-0027","府中市篠根町656","0847-41-2759","0847-41-2379",null,null,null,null,0]
[311,250,251,null,"府中市立上下中学校","34F47","729-3431","府中市上下町字上下915","0847-62-2161","0847-62-2160",null,null,null,null,0]
[312,null,null,null,"予備",null,null,null,null,null,null,null,null,null,0]
[313,null,null,null,"予備",null,null,null,null,null,null,null,null,null,0]
[314,null,null,null,"予備",null,null,null,null,null,null,null,null,null,0]
[315,251,252,"福山地区　神石郡","神石高原町立三和中学校","34F48","720-1522","神石郡神石高原町小畠1370","08478-5-4511","08478-5-4512",null,null,null,null,0]
[316,252,253,null,"神石高原町立神石中学校","34F49","729-3515","神石郡神石高原町福永甲1466","08478-7-0046","08478-7-0046",null,null,null,null,0]
[317,253,254,null,"神石高原町立油木中学校","34F50","720-1812","神石郡神石高原町油木乙2140","08478-2-0915","08478-2-0915",null,null,null,null,0]
[318,254,255,null,"神石高原町立豊松中学校","34F51","720-1704","神石郡神石高原町下豊松甲661","08478-4-2028","08478-4-2240",null,null,null,null,0]
[319,null,null,null,"予備",null,null,null,null,null,null,null,null,null,0]
[320,null,null,null,"予備",null,null,null,null,null,null,null,null,null,0]
[321,null,null,null,"予備",null,null,null,null,null,null,null,null,null,0]
[322,255,256,"備北地区　三次市","三次市立三和中学校","34G01","729-6615","三次市三和町上板木55","0824-52-3131","0824-52-3132",null,null,null,null,{"$f":"M328+N328","v":0}]
[323,256,257,null,"三次市立君田中学校","34G02","728-0401","三次市君田町東入君378","0824-53-2008","0824-53-2175",null,null,null,null,0]
[324,257,258,null,"三次市立布野中学校","34G03","728-0201","三次市布野町上布野1895-1","0824-54-2020","0824-54-7030",null,null,null,null,0]
[325,258,259,null,"三次市立作木中学校","34G04","728-0124","三次市作木町下作木739-1","0824-55-2106","0824-55-2107",null,null,null,null,0]
[326,259,260,null,"三次市立三良坂中学校","34G05","729-4303","三次市三良坂町三良坂2772","0824-44-2018","0824-44-3646",null,null,null,null,0]
[327,260,261,null,"三次市立吉舎中学校","34G06","729-4211","三次市吉舎町吉舎783","0824-43-2115","0824-43-2160",null,null,null,null,0]
[328,261,262,null,"三次市立三次中学校","34G07","728-0021","三次市三次町1731","0824-62-2896","0824-63-1417",null,null,null,null,0]
[329,262,263,null,"三次市立十日市中学校","34G08","728-0012","三次市十日市中4-2-2","0824-62-2856","0824-63-8155",null,null,null,null,0]
[330,263,264,null,"三次市立八次中学校","34G09","728-0006","三次市畠敷町1860番地","0824-62-5770","0824-62-5769",null,null,null,null,0]
[331,264,265,null,"三次市立塩町中学校","34G10","729-6211","三次市大田幸町541","0824-66-1008","0824-65-3102",null,null,null,null,0]
[332,265,266,null,"三次市立川地中学校","34G11","729-6333","三次市下川立町475-8","0824-68-2015","0824-65-4032",null,null,null,null,0]
[333,266,267,null,"三次市立甲奴中学校","34G12","729-4105","三次市甲奴町梶田38","0847-67-2200","0847-67-2293",null,null,null,null,0]
[334,null,null,null,"予備",null,null,null,null,null,null,null,null,null,0]
[335,null,null,null,"予備",null,null,null,null,null,null,null,null,null,0]
[336,null,null,null,"予備",null,null,null,null,null,null,null,null,null,0]
[337,267,268,"備北地区　庄原市","庄原市立庄原中学校","34G13","727-0011","庄原市東本町1-26-1","0824-72-2195","0824-72-2197",null,null,null,null,0]
[338,268,269,null,"庄原市立西城中学校","34G14","729-5742","庄原市西城町中野622-4","0824-82-2911","0824-82-2922",null,null,null,null,0]
[339,269,270,null,"庄原市立東城中学校","34G16","729-5152","庄原市東城町大字川東227","08477-2-0337","08477-2-1468",null,null,null,null,0]
[340,270,271,null,"庄原市立口和中学校","34G17","728-0502","庄原市口和町向泉527-1","0824-87-2301","0824-87-2302",null,null,null,null,0]
[341,271,272,null,"庄原市立高野中学校","34G18","727-0402","庄原市高野町新市1289","0824-86-2221","0824-86-2248",null,null,null,null,0]
[342,272,273,null,"庄原市立比和中学校","34G19","727-0301","庄原市比和町比和1052","0824-85-2110","0824-85-2140",null,null,null,null,0]
[343,273,274,null,"庄原市立総領中学校","34G20","729-3721","庄原市総領町稲草2125","0824-88-2035","0824-88-2831",null,null,null,null,0]
[344,null,null,null,"予備",null,null,null,null,null,null,null,null,null,0]
[345,null,null,null,"予備",null,null,null,null,null,null,null,null,null,0]
[346,null,null,null,"予備",null,null,null,null,null,null,null,null,null,0]
[347,null,null,null,"予備",null,null,null,null,null,null,null,null,null,0]
[348,null,null,null,"予備",null,null,null,null,null,null,null,null,null,0]
[349,null,null,null,"予備",null,null,null,null,null,null,null,null,null,0]
[350,null,null,null,"予備",null,null,null,null,null,null,null,null,null,0]
[351,null,null,null,"予備",null,null,null,null,null,null,null,null,null,0]
[352,null,null,null,"予備",null,null,null,null,null,null,null,null,null,0]
[353,null,null,null,"予備",null,null,null,null,null,null,null,null,null,0]
[354,null,null,null,"予備",null,null,null,null,null,null,null,null,null,0]
[355,null,null,null,"予備",null,null,null,null,null,null,null,null,null,0]
[356,null,null,null,"予備",null,null,null,null,null,null,null,null,null,0]
[357,null,null,null,"予備",null,null,null,null,null,null,null,null,null,0]
[358,null,null,null,"予備",null,null,null,null,null,null,null,null,null,0]
[359,null,null,null,"予備",null,null,null,null,null,null,null,null,null,0]
[360,null,null,null,"予備",null,null,null,null,null,null,null,null,null,0]
[361,null,null,null,"予備",null,null,null,null,null,null,null,null,null,0]
[362,null,null,null,"予備",null,null,null,null,null,null,null,null,null,0]
[363,null,null,null,"予備",null,null,null,null,null,null,null,null,null,0]
[364,null,null,null,"予備",null,null,null,null,null,null,null,null,null,0]
[365,null,null,null,"予備",null,null,null,null,null,null,null,null,null,0]
[366,null,null,null,"予備",null,null,null,null,null,null,null,null,null,0]
[367,null,null,null,"予備",null,null,null,null,null,null,null,null,null,0]
[368,null,null,null,"予備",null,null,null,null,null,null,null,null,null,0]
[369,null,null,null,"予備",null,null,null,null,null,null,null,null,null,0]
[370,null,null,null,"予備",null,null,null,null,null,null,null,null,null,0]